/[escript]/branches/arrayview_from_1695_trunk/autotest-scons
ViewVC logotype

Diff of /branches/arrayview_from_1695_trunk/autotest-scons

Parent Directory Parent Directory | Revision Log Revision Log | View Patch Patch

revision 339 by jgs, Mon Dec 12 04:22:19 2005 UTC revision 347 by svn, Tue Dec 13 06:16:16 2005 UTC
# Line 3  Line 3 
3  # $Id: autotest-scons 162 2005-11-11 00:09:59Z svn $  # $Id: autotest-scons 162 2005-11-11 00:09:59Z svn $
4  # An explicit testing script for esys using the scons build system  # An explicit testing script for esys using the scons build system
5    
   
6  # list of users to email test results to  # list of users to email test results to
7  MAIL_RECIPIENTS="jgs@esscc.uq.edu.au gross@esscc.uq.edu.au cochrane@esscc.uq.edu.au elspeth@esscc.uq.edu.au matt@esscc.uq.edu.au"  MAIL_RECIPIENTS="jgs@esscc.uq.edu.au gross@esscc.uq.edu.au cochrane@esscc.uq.edu.au elspeth@esscc.uq.edu.au matt@esscc.uq.edu.au"
8    #MAIL_RECIPIENTS="jgs@esscc.uq.edu.au"
9    
10  # modules to test  # modules to test
11  TESTS="escript bruce finley"  TESTS="escript bruce finley"
# Line 15  FINLEY_PYTESTS="ImportTest.py finleyTest Line 15  FINLEY_PYTESTS="ImportTest.py finleyTest
15  ESCRIPT_PYTESTS="ImportTest.py BinaryOps.py UnaryOps.py SliceGetting.py SliceSetting.py MiscTests.py ArchiveTests.py escriptTest.py newEscriptTests.py DataVariableTests.py test_xml.py"  ESCRIPT_PYTESTS="ImportTest.py BinaryOps.py UnaryOps.py SliceGetting.py SliceSetting.py MiscTests.py ArchiveTests.py escriptTest.py newEscriptTests.py DataVariableTests.py test_xml.py"
16  BRUCE_PYTESTS="ImportTest.py BruceTest.py test_utilOnBruce.py test_symbolsOnBruce.py"  BRUCE_PYTESTS="ImportTest.py BruceTest.py test_utilOnBruce.py test_symbolsOnBruce.py"
17    
   
 # define compiler executable and library locations  
 export PATH=/opt/intel/cmplrs/80.058/intel_cc_80/bin:$PATH  
 export LD_LIBRARY_PATH=/opt/intel/cmplrs/80.058/intel_cc_80/lib  
   
18  echo cd $1  echo cd $1
19  cd $1  cd $1
20  if [ $? != 0 ]  if [ $? != 0 ]
# Line 29  then Line 24  then
24    exit 1    exit 1
25  fi  fi
26    
27  echo loading esys setup  PWD=`pwd`
28  . ~jgs/bin/scons_setup  echo working in: $PWD
29  if [ $? != 0 ]  
30  then  # define compiler executable and library locations
31    echo couldnt load scons setup  export PATH=/opt/intel/cmplrs/80.058/intel_cc_80/bin:$PATH
32    echo "couldnt load scons setup" | mail -s "esys autotest-scons results" $MAIL_RECIPIENTS  export LD_LIBRARY_PATH=/opt/intel/cmplrs/80.058/intel_cc_80/lib
33    exit 2  
34  fi  # define python location
35    export PATH=/raid2/tools/python-2.3.4/bin:$PATH
36    
37    # set library and openmp settings
38    export LD_LIBRARY_PATH=$PWD/lib:/raid2/tools/boost/lib:$LD_LIBRARY_PATH
39    export PYTHONPATH=$PWD
40    export OMP_SCHEDULE="dynamic"
41    export OMP_NUM_THREADS=4
42    export OMP_DYNAMIC=TRUE
43    export OMP_NESTED=FALSE
44    
45    FAIL=0
46    
47  echo running svn update  echo running svn update
48  svn update  svn update
# Line 44  if [ $? != 0 ] Line 50  if [ $? != 0 ]
50  then  then
51    echo svn update failed    echo svn update failed
52    echo "svn update failed" | mail -s "esys autotest-scons results" $MAIL_RECIPIENTS    echo "svn update failed" | mail -s "esys autotest-scons results" $MAIL_RECIPIENTS
53    exit 3    exit 2
54  fi  fi
55    
56  echo running scons debug=1  echo running scons debug=1
# Line 53  if [ $? != 0 ] Line 59  if [ $? != 0 ]
59  then  then
60    echo scons failed    echo scons failed
61    echo "scons failed - see autotest-scons logfile" | mail -s "esys autotest-scons results" $MAIL_RECIPIENTS    echo "scons failed - see autotest-scons logfile" | mail -s "esys autotest-scons results" $MAIL_RECIPIENTS
62    exit 5    exit 3
63  fi  fi
64    
65  echo running bruce unit_tests  echo running bruce unit_tests
# Line 63  if [ $? != 0 ] Line 69  if [ $? != 0 ]
69  then  then
70    echo bruce unit_test failed    echo bruce unit_test failed
71    echo "bruce unit_test failed - see autotest-scons logfile" | mail -s "esys autotest-scons results" $MAIL_RECIPIENTS    echo "bruce unit_test failed - see autotest-scons logfile" | mail -s "esys autotest-scons results" $MAIL_RECIPIENTS
72    #exit 6    FAIL=1
73  fi  fi
74  cd ../..  cd ../..
75    
# Line 74  if [ $? != 0 ] Line 80  if [ $? != 0 ]
80  then  then
81    echo escript unit_test failed    echo escript unit_test failed
82    echo "escript unit_test failed - see autotest-scons logfile" | mail -s "esys autotest-scons results" $MAIL_RECIPIENTS    echo "escript unit_test failed - see autotest-scons logfile" | mail -s "esys autotest-scons results" $MAIL_RECIPIENTS
83    #exit 6    FAIL=1
84  fi  fi
85  cd ../..  cd ../..
86    
# Line 85  if [ $? != 0 ] Line 91  if [ $? != 0 ]
91  then  then
92    echo finley unit_test failed    echo finley unit_test failed
93    echo "finley unit_test failed - see autotest-scons logfile" | mail -s "esys autotest-scons results" $MAIL_RECIPIENTS    echo "finley unit_test failed - see autotest-scons logfile" | mail -s "esys autotest-scons results" $MAIL_RECIPIENTS
94    #exit 6    FAIL=1
95  fi  fi
96  cd ../..  cd ../..
97    
# Line 96  if [ $? != 0 ] Line 102  if [ $? != 0 ]
102  then  then
103    echo esysUtils unit_test failed    echo esysUtils unit_test failed
104    echo "esysUtils unit_test failed - see autotest-scons logfile" | mail -s "esys autotest-scons results" $MAIL_RECIPIENTS    echo "esysUtils unit_test failed - see autotest-scons logfile" | mail -s "esys autotest-scons results" $MAIL_RECIPIENTS
105    #exit 6    FAIL=1
106  fi  fi
107  cd ../..  cd ../..
108    
 export LD_LIBRARY_PATH=/raid2/tools/python-2.3.4/lib:$LD_LIBRARY_PATH  
 export PYTHON_INCLUDE=/raid2/tools/python-2.3.4/include/python2.3  
 export PYTHON_LIB_PATH=/raid2/tools/python-2.3.4/lib  
 export PATH=/raid2/tools/python-2.3.4/bin:$PATH  
   
109  for module in $TESTS  for module in $TESTS
110  do  do
111      echo "running python tests for: $module"      echo "running python tests for: $module"
# Line 118  do Line 119  do
119              if [ $? != 0 ]              if [ $? != 0 ]
120              then              then
121                echo Python Testing FAILED for $pytest in module $module                echo Python Testing FAILED for $pytest in module $module
122                echo "finley py_test failed - see autotest-scons logfile" | mail -s "esys autotest-scons results" $MAIL_RECIPIENTS                echo "finley py_test: $pytest failed - see autotest-scons logfile" | mail -s "esys autotest-scons results" $MAIL_RECIPIENTS
123                #exit 1                FAIL=1
124              fi              fi
125          done          done
126      elif [ "$module" == "escript" ]      elif [ "$module" == "escript" ]
# Line 131  do Line 132  do
132              if [ $? != 0 ]              if [ $? != 0 ]
133              then              then
134                echo Python Testing FAILED for $pytest in module $module                echo Python Testing FAILED for $pytest in module $module
135                echo "escript py_test failed - see autotest-scons logfile" | mail -s "esys autotest-scons results" $MAIL_RECIPIENTS                echo "escript py_test: $pytest failed - see autotest-scons logfile" | mail -s "esys autotest-scons results" $MAIL_RECIPIENTS
136                #exit 1                FAIL=1
137              fi              fi
138          done          done
139      elif [ "$module" == "bruce" ]      elif [ "$module" == "bruce" ]
# Line 144  do Line 145  do
145              if [ $? != 0 ]              if [ $? != 0 ]
146              then              then
147                echo Python Testing FAILED for $pytest in module $module                echo Python Testing FAILED for $pytest in module $module
148                echo "bruce py_test failed - see autotest-scons logfile" | mail -s "esys autotest-scons results" $MAIL_RECIPIENTS                echo "bruce py_test: $pytest failed - see autotest-scons logfile" | mail -s "esys autotest-scons results" $MAIL_RECIPIENTS
149                #exit 1                FAIL=1
150              fi              fi
151          done          done
152      fi      fi
153      cd ../../..      cd ../../..
154  done  done
155    
156  echo success  if [ $FAIL == 0 ]
157  echo "success" | mail -s "esys autotest-scons results" $MAIL_RECIPIENTS  then
158        echo success
159        echo "success" | mail -s "esys autotest-scons results" $MAIL_RECIPIENTS
160    fi
161  exit 0  exit 0

Legend:
Removed from v.339  
changed lines
  Added in v.347

  ViewVC Help
Powered by ViewVC 1.1.26