/[escript]/branches/arrayview_from_1695_trunk/autotest-scons
ViewVC logotype

Diff of /branches/arrayview_from_1695_trunk/autotest-scons

Parent Directory Parent Directory | Revision Log Revision Log | View Patch Patch

revision 336 by svn, Thu Dec 8 23:34:44 2005 UTC revision 356 by jgs, Wed Dec 14 05:37:24 2005 UTC
# Line 3  Line 3 
3  # $Id: autotest-scons 162 2005-11-11 00:09:59Z svn $  # $Id: autotest-scons 162 2005-11-11 00:09:59Z svn $
4  # An explicit testing script for esys using the scons build system  # An explicit testing script for esys using the scons build system
5    
   
6  # list of users to email test results to  # list of users to email test results to
7  MAIL_RECIPIENTS="jgs@esscc.uq.edu.au gross@esscc.uq.edu.au cochrane@esscc.uq.edu.au elspeth@esscc.uq.edu.au matt@esscc.uq.edu.au"  MAIL_RECIPIENTS="jgs@esscc.uq.edu.au gross@esscc.uq.edu.au cochrane@esscc.uq.edu.au elspeth@esscc.uq.edu.au matt@esscc.uq.edu.au"
8    #MAIL_RECIPIENTS="jgs@esscc.uq.edu.au"
9    
10  # modules to test  # modules to test
11  TESTS="escript bruce finley"  TESTS="escript bruce finley"
12    
13  # the python tests to run  # the python tests to run
14  FINLEY_PYTESTS="ImportTest.py SimpleSolve.py GradTest.py test_linearPDEsOnFinley.py test_generators.py test_visualization_interface.py test_utilOnFinley.py test_symbolsOnFinley.py"  FINLEY_PYTESTS="ImportTest.py finleyTest.py SimpleSolve.py GradTest.py RecTest.py test_linearPDEsOnFinley.py test_generators.py test_visualization_interface.py test_utilOnFinley.py test_symbolsOnFinley.py"
15  #ESCRIPT_PYTESTS="ImportTest.py BinaryOps.py UnaryOps.py SliceGetting.py SliceSetting.py MiscTests.py newEscriptTests.py DataVariableTests.py test_xml.py"  ESCRIPT_PYTESTS="ImportTest.py BinaryOps.py UnaryOps.py SliceGetting.py SliceSetting.py MiscTests.py ArchiveTests.py escriptTest.py newEscriptTests.py DataVariableTests.py test_xml.py"
 ESCRIPT_PYTESTS="ImportTest.py BinaryOps.py UnaryOps.py SliceGetting.py SliceSetting.py MiscTests.py newEscriptTests.py DataVariableTests.py"  
16  BRUCE_PYTESTS="ImportTest.py BruceTest.py test_utilOnBruce.py test_symbolsOnBruce.py"  BRUCE_PYTESTS="ImportTest.py BruceTest.py test_utilOnBruce.py test_symbolsOnBruce.py"
17    
   
 # define compiler executable and library locations  
 export PATH=/opt/intel/cmplrs/80.058/intel_cc_80/bin:$PATH  
 export LD_LIBRARY_PATH=/opt/intel/cmplrs/80.058/intel_cc_80/lib  
   
18  echo cd $1  echo cd $1
19  cd $1  cd $1
20  if [ $? != 0 ]  if [ $? != 0 ]
# Line 30  then Line 24  then
24    exit 1    exit 1
25  fi  fi
26    
27  echo loading esys setup  PWD=`pwd`
28  . ~jgs/bin/scons_setup  echo working in: $PWD
29  if [ $? != 0 ]  
30  then  # define compiler executable and library locations
31    echo couldnt load scons setup  export PATH=/opt/intel/cmplrs/80.058/intel_cc_80/bin:$PATH
32    echo "couldnt load scons setup" | mail -s "esys autotest-scons results" $MAIL_RECIPIENTS  export LD_LIBRARY_PATH=/opt/intel/cmplrs/80.058/intel_cc_80/lib
33    exit 2  
34  fi  # define python location
35    export PATH=/raid2/tools/python-2.3.4/bin:$PATH
36    
37    # set library and openmp settings
38    export LD_LIBRARY_PATH=$PWD/lib:/raid2/tools/boost/lib:$LD_LIBRARY_PATH
39    export PYTHONPATH=$PWD
40    export OMP_SCHEDULE="dynamic"
41    export OMP_NUM_THREADS=4
42    export OMP_DYNAMIC=TRUE
43    export OMP_NESTED=FALSE
44    
45    FAIL=0
46    
47  echo running svn update  echo running svn update
48  svn update  svn update
# Line 45  if [ $? != 0 ] Line 50  if [ $? != 0 ]
50  then  then
51    echo svn update failed    echo svn update failed
52    echo "svn update failed" | mail -s "esys autotest-scons results" $MAIL_RECIPIENTS    echo "svn update failed" | mail -s "esys autotest-scons results" $MAIL_RECIPIENTS
53    exit 3    exit 2
54  fi  fi
55    
56  echo running scons debug=1  echo running scons debug=1
57  scons debug=1  scons debug=1
58    scons debug=1 build_tests
59  if [ $? != 0 ]  if [ $? != 0 ]
60  then  then
61    echo scons failed    echo scons failed
62    echo "scons failed - see autotest-scons logfile" | mail -s "esys autotest-scons results" $MAIL_RECIPIENTS    echo "scons failed - see autotest-scons logfile" | mail -s "esys autotest-scons results" $MAIL_RECIPIENTS
63    exit 5    exit 3
64  fi  fi
65    
66  echo running bruce unit_tests  echo running bruce unit_tests
# Line 64  if [ $? != 0 ] Line 70  if [ $? != 0 ]
70  then  then
71    echo bruce unit_test failed    echo bruce unit_test failed
72    echo "bruce unit_test failed - see autotest-scons logfile" | mail -s "esys autotest-scons results" $MAIL_RECIPIENTS    echo "bruce unit_test failed - see autotest-scons logfile" | mail -s "esys autotest-scons results" $MAIL_RECIPIENTS
73    exit 6    FAIL=1
74  fi  fi
75  cd ../..  cd ../..
76    
# Line 75  if [ $? != 0 ] Line 81  if [ $? != 0 ]
81  then  then
82    echo escript unit_test failed    echo escript unit_test failed
83    echo "escript unit_test failed - see autotest-scons logfile" | mail -s "esys autotest-scons results" $MAIL_RECIPIENTS    echo "escript unit_test failed - see autotest-scons logfile" | mail -s "esys autotest-scons results" $MAIL_RECIPIENTS
84    exit 6    FAIL=1
85  fi  fi
86  cd ../..  cd ../..
87    
# Line 86  if [ $? != 0 ] Line 92  if [ $? != 0 ]
92  then  then
93    echo finley unit_test failed    echo finley unit_test failed
94    echo "finley unit_test failed - see autotest-scons logfile" | mail -s "esys autotest-scons results" $MAIL_RECIPIENTS    echo "finley unit_test failed - see autotest-scons logfile" | mail -s "esys autotest-scons results" $MAIL_RECIPIENTS
95    exit 6    FAIL=1
96  fi  fi
97  cd ../..  cd ../..
98    
# Line 97  if [ $? != 0 ] Line 103  if [ $? != 0 ]
103  then  then
104    echo esysUtils unit_test failed    echo esysUtils unit_test failed
105    echo "esysUtils unit_test failed - see autotest-scons logfile" | mail -s "esys autotest-scons results" $MAIL_RECIPIENTS    echo "esysUtils unit_test failed - see autotest-scons logfile" | mail -s "esys autotest-scons results" $MAIL_RECIPIENTS
106    exit 6    FAIL=1
107  fi  fi
108  cd ../..  cd ../..
109    
 export LD_LIBRARY_PATH=/raid2/tools/python-2.3.4/lib:$LD_LIBRARY_PATH  
 export PYTHON_INCLUDE=/raid2/tools/python-2.3.4/include/python2.3  
 export PYTHON_LIB_PATH=/raid2/tools/python-2.3.4/lib  
 export PATH=/raid2/tools/python-2.3.4/bin:$PATH  
   
110  for module in $TESTS  for module in $TESTS
111  do  do
112      echo "running python tests for: $module"      echo "running python tests for: $module"
# Line 119  do Line 120  do
120              if [ $? != 0 ]              if [ $? != 0 ]
121              then              then
122                echo Python Testing FAILED for $pytest in module $module                echo Python Testing FAILED for $pytest in module $module
123                echo "finley py_test failed - see autotest-scons logfile" | mail -s "esys autotest-scons results" $MAIL_RECIPIENTS                echo "finley py_test: $pytest failed - see autotest-scons logfile" | mail -s "esys autotest-scons results" $MAIL_RECIPIENTS
124                exit 1                FAIL=1
125              fi              fi
126          done          done
127      elif [ "$module" == "escript" ]      elif [ "$module" == "escript" ]
# Line 132  do Line 133  do
133              if [ $? != 0 ]              if [ $? != 0 ]
134              then              then
135                echo Python Testing FAILED for $pytest in module $module                echo Python Testing FAILED for $pytest in module $module
136                echo "escript py_test failed - see autotest-scons logfile" | mail -s "esys autotest-scons results" $MAIL_RECIPIENTS                echo "escript py_test: $pytest failed - see autotest-scons logfile" | mail -s "esys autotest-scons results" $MAIL_RECIPIENTS
137                exit 1                FAIL=1
138              fi              fi
139          done          done
140      elif [ "$module" == "bruce" ]      elif [ "$module" == "bruce" ]
# Line 145  do Line 146  do
146              if [ $? != 0 ]              if [ $? != 0 ]
147              then              then
148                echo Python Testing FAILED for $pytest in module $module                echo Python Testing FAILED for $pytest in module $module
149                echo "bruce py_test failed - see autotest-scons logfile" | mail -s "esys autotest-scons results" $MAIL_RECIPIENTS                echo "bruce py_test: $pytest failed - see autotest-scons logfile" | mail -s "esys autotest-scons results" $MAIL_RECIPIENTS
150                exit 1                FAIL=1
151              fi              fi
152          done          done
153      fi      fi
154      cd ../../..      cd ../../..
155  done  done
156    
157  echo success  if [ $FAIL == 0 ]
158  echo "success" | mail -s "esys autotest-scons results" $MAIL_RECIPIENTS  then
159        echo success
160        echo "success" | mail -s "esys autotest-scons results" $MAIL_RECIPIENTS
161    fi
162  exit 0  exit 0

Legend:
Removed from v.336  
changed lines
  Added in v.356

  ViewVC Help
Powered by ViewVC 1.1.26