/[escript]/branches/cookbookdev/autotest-scons
ViewVC logotype

Annotation of /branches/cookbookdev/autotest-scons

Parent Directory Parent Directory | Revision Log Revision Log


Revision 356 - (hide annotations)
Wed Dec 14 05:37:24 2005 UTC (13 years, 4 months ago) by jgs
Original Path: trunk/autotest-scons
File size: 4671 byte(s)
add scons line to build unit-tests

1 jgs 318 #!/bin/bash
2    
3 svn 336 # $Id: autotest-scons 162 2005-11-11 00:09:59Z svn $
4 jgs 318 # An explicit testing script for esys using the scons build system
5    
6     # list of users to email test results to
7 svn 347 MAIL_RECIPIENTS="jgs@esscc.uq.edu.au gross@esscc.uq.edu.au cochrane@esscc.uq.edu.au elspeth@esscc.uq.edu.au matt@esscc.uq.edu.au"
8     #MAIL_RECIPIENTS="jgs@esscc.uq.edu.au"
9 jgs 318
10 svn 336 # modules to test
11 jgs 321 TESTS="escript bruce finley"
12    
13     # the python tests to run
14 jgs 339 FINLEY_PYTESTS="ImportTest.py finleyTest.py SimpleSolve.py GradTest.py RecTest.py test_linearPDEsOnFinley.py test_generators.py test_visualization_interface.py test_utilOnFinley.py test_symbolsOnFinley.py"
15     ESCRIPT_PYTESTS="ImportTest.py BinaryOps.py UnaryOps.py SliceGetting.py SliceSetting.py MiscTests.py ArchiveTests.py escriptTest.py newEscriptTests.py DataVariableTests.py test_xml.py"
16 jgs 321 BRUCE_PYTESTS="ImportTest.py BruceTest.py test_utilOnBruce.py test_symbolsOnBruce.py"
17    
18 svn 346 echo cd $1
19     cd $1
20     if [ $? != 0 ]
21     then
22     echo couldnt cd $1
23     echo "couldnt cd $1" | mail -s "esys autotest-scons results" $MAIL_RECIPIENTS
24     exit 1
25     fi
26    
27 svn 344 PWD=`pwd`
28     echo working in: $PWD
29 jgs 321
30 jgs 318 # define compiler executable and library locations
31     export PATH=/opt/intel/cmplrs/80.058/intel_cc_80/bin:$PATH
32     export LD_LIBRARY_PATH=/opt/intel/cmplrs/80.058/intel_cc_80/lib
33    
34 svn 344 # define python location
35     export PATH=/raid2/tools/python-2.3.4/bin:$PATH
36    
37     # set library and openmp settings
38     export LD_LIBRARY_PATH=$PWD/lib:/raid2/tools/boost/lib:$LD_LIBRARY_PATH
39     export PYTHONPATH=$PWD
40     export OMP_SCHEDULE="dynamic"
41     export OMP_NUM_THREADS=4
42     export OMP_DYNAMIC=TRUE
43     export OMP_NESTED=FALSE
44    
45     FAIL=0
46    
47 svn 320 echo running svn update
48     svn update
49     if [ $? != 0 ]
50     then
51     echo svn update failed
52 svn 336 echo "svn update failed" | mail -s "esys autotest-scons results" $MAIL_RECIPIENTS
53 svn 344 exit 2
54 svn 320 fi
55 jgs 319
56 svn 320 echo running scons debug=1
57     scons debug=1
58 jgs 356 scons debug=1 build_tests
59 svn 320 if [ $? != 0 ]
60     then
61     echo scons failed
62 svn 336 echo "scons failed - see autotest-scons logfile" | mail -s "esys autotest-scons results" $MAIL_RECIPIENTS
63 svn 344 exit 3
64 svn 320 fi
65    
66 jgs 319 echo running bruce unit_tests
67     cd bruce/test
68 svn 320 ./unit_test-scons
69 jgs 318 if [ $? != 0 ]
70     then
71 jgs 319 echo bruce unit_test failed
72 svn 336 echo "bruce unit_test failed - see autotest-scons logfile" | mail -s "esys autotest-scons results" $MAIL_RECIPIENTS
73 svn 344 FAIL=1
74 jgs 318 fi
75 svn 320 cd ../..
76 jgs 318
77 jgs 319 echo running escript unit_tests
78     cd escript/test
79 svn 320 ./unit_test-scons
80 jgs 318 if [ $? != 0 ]
81     then
82 jgs 319 echo escript unit_test failed
83 svn 336 echo "escript unit_test failed - see autotest-scons logfile" | mail -s "esys autotest-scons results" $MAIL_RECIPIENTS
84 svn 344 FAIL=1
85 jgs 318 fi
86 svn 320 cd ../..
87 jgs 318
88 jgs 319 echo running finley unit_tests
89     cd finley/test
90 svn 320 ./unit_test-scons
91 jgs 319 if [ $? != 0 ]
92     then
93     echo finley unit_test failed
94 svn 336 echo "finley unit_test failed - see autotest-scons logfile" | mail -s "esys autotest-scons results" $MAIL_RECIPIENTS
95 svn 344 FAIL=1
96 jgs 319 fi
97 svn 320 cd ../..
98 jgs 318
99 svn 336 echo running esysUtils unit_tests
100     cd esysUtils/test
101     ./unit_test-scons
102     if [ $? != 0 ]
103     then
104     echo esysUtils unit_test failed
105     echo "esysUtils unit_test failed - see autotest-scons logfile" | mail -s "esys autotest-scons results" $MAIL_RECIPIENTS
106 svn 344 FAIL=1
107 svn 336 fi
108     cd ../..
109    
110 jgs 321 for module in $TESTS
111     do
112     echo "running python tests for: $module"
113     cd $module/test/python
114     if [ "$module" == "finley" ]
115     then
116     for pytest in $FINLEY_PYTESTS
117     do
118     echo "Running python test: $pytest"
119     python $pytest
120     if [ $? != 0 ]
121     then
122     echo Python Testing FAILED for $pytest in module $module
123 svn 344 echo "finley py_test: $pytest failed - see autotest-scons logfile" | mail -s "esys autotest-scons results" $MAIL_RECIPIENTS
124     FAIL=1
125 jgs 321 fi
126     done
127     elif [ "$module" == "escript" ]
128     then
129     for pytest in $ESCRIPT_PYTESTS
130     do
131     echo "Running python test: $pytest"
132     python $pytest
133     if [ $? != 0 ]
134     then
135     echo Python Testing FAILED for $pytest in module $module
136 svn 344 echo "escript py_test: $pytest failed - see autotest-scons logfile" | mail -s "esys autotest-scons results" $MAIL_RECIPIENTS
137     FAIL=1
138 jgs 321 fi
139     done
140     elif [ "$module" == "bruce" ]
141     then
142     for pytest in $BRUCE_PYTESTS
143     do
144     echo "Running python test: $pytest"
145     python $pytest
146     if [ $? != 0 ]
147     then
148     echo Python Testing FAILED for $pytest in module $module
149 svn 344 echo "bruce py_test: $pytest failed - see autotest-scons logfile" | mail -s "esys autotest-scons results" $MAIL_RECIPIENTS
150     FAIL=1
151 jgs 321 fi
152     done
153     fi
154 svn 330 cd ../../..
155 jgs 321 done
156 jgs 318
157 svn 344 if [ $FAIL == 0 ]
158     then
159     echo success
160     echo "success" | mail -s "esys autotest-scons results" $MAIL_RECIPIENTS
161     fi
162 jgs 318 exit 0

Properties

Name Value
svn:executable *

  ViewVC Help
Powered by ViewVC 1.1.26