/[escript]/branches/more_shared_ptrs_from_1812/autotest-scons
ViewVC logotype

Diff of /branches/more_shared_ptrs_from_1812/autotest-scons

Parent Directory Parent Directory | Revision Log Revision Log | View Patch Patch

trunk/autotest-scons revision 683 by robwdcock, Mon Mar 27 05:46:50 2006 UTC temp_trunk_copy/autotest-scons revision 1384 by phornby, Fri Jan 11 02:29:38 2008 UTC
# Line 1  Line 1 
1    #!/bin/sh
2    
3    #
4    # Submit a PBS job to run the tests
5    #
6    #   Usage: autotest-scons       # Short testing, only C++ tests
7    #   Usage: autotest-scons run_tests # Short testing, only C++ tests
8    #   Usage: autotest-scons all_tests # Long testing, C++ and python tests
9    #
10    # Copy this somewhere and run it every day via cron
11    #
12    # This file should be maintained in SVN as esys13/trunk/autotest-scons,
13    # be sure to copy it there and commit after modification
14    #
15    
16    # Which tests should we run?
17    target='run_tests'  # Default scons target that runs the tests
18    test "x$1" != "x" && target="$1"
19    requested_cpus=2
20    test "x$target" = "xall_tests" && requested_cpus=4
21    
22    MAIL_RECIPIENTS="l.gross@uq.edu.au matt@esscc.uq.edu.au robert.woodcock@csiro.au Peter.Hornby@csiro.au k.steube@uq.edu.au"
23    # MAIL_RECIPIENTS="k.steube@uq.edu.au"
24    
25    # This time is when the job was submitted. If it waits in the queue it might run on another day.
26    # This date is also used to create the sandbox directory where the tests are run.
27    RunDate=`date '+%Y_%m_%d'`  # Time stamp for log file names
28    
29    WorkDir=/raid3/ksteube/AutoTests
30    cd $WorkDir
31    
32    # Where to put the output of scons run_tests
33    out_file="$WorkDir/Logs/$RunDate.test.output"
34    
35    # Save the name of this script
36    SCRIPT_NAME=$0
37    
38    # Below here \$variable means I want the variable interpreted when PBS runs the job, not when the job is submitted
39    # Similarly for \`...\`
40    
41    # Write the PBS script to run the tests
42    cat << EOF > Logs/$RunDate.pbs.script.sh
43  #!/bin/bash  #!/bin/bash
44    
45  # $Id: autotest-scons 162 2005-11-11 00:09:59Z svn $  #PBS -q q80
46  # An explicit testing script for esys using the scons build system  #PBS -N autotest
47    #PBS -l ncpus=$requested_cpus
48    #PBS -o $RunDate.pbs.stdout
49    #PBS -e $RunDate.pbs.stderr
50    #PBS -W umask=022
51    
52    echo "PBS_JOBNAME       \$PBS_JOBNAME"
53    echo "PBS_JOBID         \$PBS_JOBID"
54    echo "PBS_QUEUE         \$PBS_QUEUE"
55    echo "NCPUS             \$NCPUS"
56    echo "USER              \$USER"
57    echo "PBS_O_HOST        \$PBS_O_HOST"
58    echo "PBS_O_WORKDIR     \$PBS_O_WORKDIR"
59    echo "PBS_O_SHELL       \$PBS_O_SHELL"
60    date
61    echo ""
62    echo ""
63    
 # list of users to email test results to  
 MAIL_RECIPIENTS="gross@esscc.uq.edu.au elspeth@esscc.uq.edu.au matt@esscc.uq.edu.au robert.woodcock@csiro.au Peter.Hornby@csiro.au"  
64    
 # the python tests to run  
 BRUCE_PYTESTS="ImportTest.passed BruceTest.passed test_utilOnBruce.py"  
 ESCRIPT_PYTESTS="ImportTest.passed BinaryOps.passed UnaryOps.passed SliceGetting.passed SliceSetting.passed MiscTests.passed ArchiveTests.passed newEscriptTests.passed test_xml.passed insituTests.passed s2.passed"  
 FINLEY_PYTESTS="ImportTest.passed finleyTest.passed SimpleSolve.passed RecTest.passed test_linearPDEsOnFinley.passed test_generators.passed test_visualization_interface.passed test_utilOnFinley.passed"  
   
 echo "===> cd $1"  
 cd $1  
 if [ $? != 0 ]  
 then  
   echo "couldnt cd $1"  
   echo "couldnt cd $1" | mail -s "esys autotest-scons results" $MAIL_RECIPIENTS  
   exit 1  
 fi  
   
 PWD=`pwd`  
 echo "===> working in: $PWD"  
   
 # Setup the environment  
 . ${MODULESHOME}/init/sh  
 module load intel_cc.9.0.026  
 export MODULEPATH=${MODULEPATH}:/data/raid2/toolspp4/modulefiles/gcc-3.3.6  
 module load boost/1.33.0/python-2.4.1  
 module load python/2.4.1  
 module load numarray/1.3.3  
65    
66  # set openmp settings  START=\`date '+%Y/%m/%d %H:%M'\`
67  export OMP_SCHEDULE="dynamic"  
68  export OMP_NUM_THREADS=4  finish () {
69  export OMP_DYNAMIC=TRUE    # state will be 'FAILURE' or 'SUCCESS'
70  export OMP_NESTED=FALSE    state="\$1"
71      date
72  echo "===> svn update"    # Clean up the sandbox
73  svn update    cd $WorkDir
74  if [ $? != 0 ]    /bin/rm -rf sandbox.$RunDate
75  then    END=\`date '+%Y/%m/%d %H:%M'\`
76    echo "svn update failed"    cat << END_MSG | mail -s "ESYS_TESTS $target $RunDate \$state" $MAIL_RECIPIENTS
77    echo "svn update failed" | mail -s "esys autotest-scons results" $MAIL_RECIPIENTS  \$2.
78    exit 2  The tests ran from \$START to \$END on \$NCPUS CPUs
79  fi  See the log files in $WorkDir/Logs/$RunDate*
80    This mail was sent by $SCRIPT_NAME
81  echo "===> scons building esys"  running as \$USER on \`hostname\`.
82  scons  END_MSG
83  if [ $? != 0 ]    if [ "x\$state" = "xFAILURE" ]; then
84  then      touch Logs/$RunDate.FAILURE
85    echo "scons build failed"      exit 1
   echo "scons build failed" | mail -s "esys autotest-scons results" $MAIL_RECIPIENTS  
   exit 3  
 fi  
   
 echo "===> building unit_tests"  
 scons build_tests  
 if [ $? != 0 ]  
 then  
   echo "unit_test build failed"  
   echo "unit_test build failed" | mail -s "esys autotest-scons results" $MAIL_RECIPIENTS  
   exit 3  
 fi  
   
 FAIL=0  
   
 echo "===> running unit_tests"  
 scons run_tests  
 if [ $? != 0 ]  
 then  
   echo "unit_testing failed"  
   echo "unit_test failed" | mail -s "esys autotest-scons results" $MAIL_RECIPIENTS  
   FAIL=1  
 fi  
   
 for pytest in $ESCRIPT_PYTESTS  
 do  
   echo "===>running escript python test: $pytest"  
   scons build/posix/escript/test/python/$pytest  
   if [ $? != 0 ]  
   then  
     echo "python testing failed for $pytest in module $module"  
     echo "escript py_test: $pytest failed" | mail -s "esys autotest-scons results" $MAIL_RECIPIENTS  
     FAIL=1  
86    fi    fi
87  done    exit 0
88    }
89    
 for pytest in $FINLEY_PYTESTS  
 do  
   echo "running finley python test: $pytest"  
   scons build/posix/finley/test/python/$pytest  
   if [ $? != 0 ]  
   then  
     echo "python testing failed for $pytest in module $module"  
     echo "finley py_test: $pytest failed" | mail -s "esys autotest-scons results" $MAIL_RECIPIENTS  
     FAIL=1  
   fi  
 done  
90    
91  for pytest in $BRUCE_PYTESTS  # set -x
92  do  
93    echo "running bruce python test: $pytest"  
94    scons build/posix/bruce/test/python/$pytest  cd $WorkDir             || finish FAILURE "Could not cd to WorkDir $WorkDir"
95    if [ $? != 0 ]  
96    then  # Create an empty out_file
97      echo "python testing failed for $pytest in module $module"  cat /dev/null > $out_file       || finish FAILURE "Could not create out_file $out_file"
98      echo "bruce py_test: $pytest failed" | mail -s "esys autotest-scons results" $MAIL_RECIPIENTS  
99      FAIL=1  umask 022
100    fi  
101  done  test -d sandbox.$RunDate        && finish FAILURE "Today's sandbox already exists"
102    mkdir sandbox.$RunDate          || finish FAILURE "Could not mkdir sandbox"
103    cd sandbox.$RunDate         || finish FAILURE "Could not cd to sandbox"
104    
105    echo "Checking out esys13/trunk"
106    svn checkout svn+ssh://shake200.esscc.uq.edu.au/home/www_svn/repos/esys13/trunk >> $out_file 2>&1 || finish FAILURE "Could not check out esys13/trunk"
107    
108    # Load modules
109    . /opt/modules/default/init/bash
110    module use /raid2/matt/modules/modulefiles
111    module use /raid2/toolspp4/modulefiles/gcc-3.3.6
112    module use /usr/share/modules/modulefiles
113    module load esys/env    # Recommended modules
114    module load doxygen/1.4.6
115    module load boost/1.33.0/python-2.4.1
116    module load gmsh-1.65.0
117    module load epydoc/2.1/python-2.4.3
118    
119    # How many threads? One per CPU.
120    export OMP_NUM_THREADS=\$NCPUS
121    
122    # Run the tests
123    echo "Running the tests $target"
124    cd trunk                || finish FAILURE "Could not cd to trunk"
125    scons -j \$NCPUS $target >> $out_file 2>&1      || finish FAILURE "Could not run scons $target"
126    
127    # Run epydoc to create the python documentation
128    echo "Running epydoc"
129    export LD_LIBRARY_PATH="$PWD/lib:$LD_LIBRARY_PATH"
130    mkdir release release/doc release/doc/epydoc
131    scons api_epydoc >> $out_file 2>&1      || finish FAILURE "Could not run scons api_epydoc"
132    cd release/doc/epydoc
133    tar cf - . | ssh shake200 "cd /home/www/esys/esys13/nightly/epydoc; tar xf -"   || finish FAILURE "Could not copy epydoc to shake200"
134    cd ../../..
135    
136    echo "Cleaning up after the tests"
137    
138    # Delete files older than 60 days
139    find $WorkDir -atime +60 -exec rm -f {} \;
140    
141    finish SUCCESS "Successfully ran 'scons $target' on \`hostname\`"
142    
143    EOF
144    
145    # cd to the logs area so the PBS logs are deposited there
146    cd $WorkDir/Logs
147    
148    # Submit the job
149    . /opt/modules/default/init/sh
150    module load pbspro
151    
152    # Submit the job
153    qsub -S /bin/bash $RunDate.pbs.script.sh > /dev/null
154    
 if [ $FAIL == 0 ]  
 then  
     echo success  
     echo "success" | mail -s "esys autotest-scons results" $MAIL_RECIPIENTS  
 fi  
 exit 0  

Legend:
Removed from v.683  
changed lines
  Added in v.1384

  ViewVC Help
Powered by ViewVC 1.1.26