/[escript]/branches/windows_from_1456_trunk_1544_merged_in_old/autotest-scons
ViewVC logotype

Diff of /branches/windows_from_1456_trunk_1544_merged_in_old/autotest-scons

Parent Directory Parent Directory | Revision Log Revision Log | View Patch Patch

revision 707 by gross, Wed Apr 12 23:58:02 2006 UTC revision 1388 by trankine, Fri Jan 11 07:45:58 2008 UTC
# Line 1  Line 1 
1  #!/bin/bash  #!/bin/sh
2  #          Copyright 2006 by ACcESS MNRF  
3    #
4    # Submit a PBS job to run the tests
5  #  #
6  #              http://www.access.edu.au  #   Usage: autotest-scons       # Short testing, only C++ tests
7  #       Primary Business: Queensland, Australia  #   Usage: autotest-scons run_tests # Short testing, only C++ tests
8  #  Licensed under the Open Software License version 3.0  #   Usage: autotest-scons all_tests # Long testing, C++ and python tests
 #     http://www.opensource.org/licenses/osl-3.0.php  
9  #  #
10    # Copy this somewhere and run it every day via cron
11  #  #
12    # This file should be maintained in SVN as esys13/trunk/autotest-scons,
13    # be sure to copy it there and commit after modification
14  #  #
 # $Id: autotest-scons 162 2005-11-11 00:09:59Z svn $  
 # An explicit testing script for esys using the scons build system  
15    
16  # list of users to email test results to  # Which tests should we run?
17  MAIL_RECIPIENTS="gross@esscc.uq.edu.au elspeth@esscc.uq.edu.au matt@esscc.uq.edu.au robert.woodcock@csiro.au Peter.Hornby@csiro.au"  target='run_tests'  # Default scons target that runs the tests
18    test "x$1" != "x" && target="$1"
19    requested_cpus=2
20    test "x$target" = "xall_tests" && requested_cpus=4
21    
22    MAIL_RECIPIENTS="l.gross@uq.edu.au matt@esscc.uq.edu.au robert.woodcock@csiro.au Peter.Hornby@csiro.au k.steube@uq.edu.au"
23    # MAIL_RECIPIENTS="k.steube@uq.edu.au"
24    
25    # This time is when the job was submitted. If it waits in the queue it might run on another day.
26    # This date is also used to create the sandbox directory where the tests are run.
27    RunDate=`date '+%Y_%m_%d'`  # Time stamp for log file names
28    
29    WorkDir=/raid3/ksteube/AutoTests
30    cd $WorkDir
31    
32    # Where to put the output of scons run_tests
33    out_file="$WorkDir/Logs/$RunDate.test.output"
34    
35    # Save the name of this script
36    SCRIPT_NAME=$0
37    
38    # Below here \$variable means I want the variable interpreted when PBS runs the job, not when the job is submitted
39    # Similarly for \`...\`
40    
41    # Write the PBS script to run the tests
42    cat << EOF > Logs/$RunDate.pbs.script.sh
43    #!/bin/bash
44    
45  # the python tests to run  #PBS -q q80
46  BRUCE_PYTESTS="ImportTest.passed BruceTest.passed test_utilOnBruce.py"  #PBS -N autotest
47  ESCRIPT_PYTESTS="ImportTest.passed BinaryOps.passed UnaryOps.passed SliceGetting.passed SliceSetting.passed MiscTests.passed ArchiveTests.passed newEscriptTests.passed test_xml.passed insituTests.passed s2.passed"  #PBS -l ncpus=$requested_cpus
48  FINLEY_PYTESTS="ImportTest.passed finleyTest.passed SimpleSolve.passed RecTest.passed test_linearPDEsOnFinley.passed test_generators.passed test_visualization_interface.passed test_utilOnFinley.passed"  #PBS -o $RunDate.pbs.stdout
49    #PBS -e $RunDate.pbs.stderr
50  echo "===> cd $1"  #PBS -W umask=022
51  cd $1  
52  if [ $? != 0 ]  echo "PBS_JOBNAME       \$PBS_JOBNAME"
53  then  echo "PBS_JOBID         \$PBS_JOBID"
54    echo "couldnt cd $1"  echo "PBS_QUEUE         \$PBS_QUEUE"
55    echo "couldnt cd $1" | mail -s "esys autotest-scons results" $MAIL_RECIPIENTS  echo "NCPUS             \$NCPUS"
56    exit 1  echo "USER              \$USER"
57  fi  echo "PBS_O_HOST        \$PBS_O_HOST"
58    echo "PBS_O_WORKDIR     \$PBS_O_WORKDIR"
59  PWD=`pwd`  echo "PBS_O_SHELL       \$PBS_O_SHELL"
60  echo "===> working in: $PWD"  date
61    echo ""
62  # Setup the environment  echo ""
63  . ${MODULESHOME}/init/sh  
64  module load intel_cc.9.0.026  
65  export MODULEPATH=${MODULEPATH}:/data/raid2/toolspp4/modulefiles/gcc-3.3.6  
66  module load python/2.4.1  START=\`date '+%Y/%m/%d %H:%M'\`
67    
68    finish () {
69      # state will be 'FAILURE' or 'SUCCESS'
70      state="\$1"
71      date
72      # Clean up the sandbox
73      cd $WorkDir
74      /bin/rm -rf sandbox.$RunDate
75      END=\`date '+%Y/%m/%d %H:%M'\`
76      cat << END_MSG | mail -s "ESYS_TESTS $target $RunDate \$state" $MAIL_RECIPIENTS
77    \$2.
78    The tests ran from \$START to \$END on \$NCPUS CPUs
79    See the log files in $WorkDir/Logs/$RunDate*
80    This mail was sent by $SCRIPT_NAME
81    running as \$USER on \`hostname\`.
82    END_MSG
83      if [ "x\$state" = "xFAILURE" ]; then
84        touch Logs/$RunDate.FAILURE
85        exit 1
86      fi
87      exit 0
88    }
89    
90    
91    # set -x
92    
93    
94    cd $WorkDir             || finish FAILURE "Could not cd to WorkDir $WorkDir"
95    
96    # Create an empty out_file
97    cat /dev/null > $out_file       || finish FAILURE "Could not create out_file $out_file"
98    
99    umask 022
100    
101    test -d sandbox.$RunDate        && finish FAILURE "Today's sandbox already exists"
102    mkdir sandbox.$RunDate          || finish FAILURE "Could not mkdir sandbox"
103    cd sandbox.$RunDate         || finish FAILURE "Could not cd to sandbox"
104    
105    echo "Checking out esys13/trunk"
106    svn checkout svn+ssh://shake200.esscc.uq.edu.au/home/www_svn/repos/esys13/trunk >> $out_file 2>&1 || finish FAILURE "Could not check out esys13/trunk"
107    
108    # Load modules
109    . /opt/modules/default/init/bash
110    module use /raid2/matt/modules/modulefiles
111    module use /raid2/toolspp4/modulefiles/gcc-3.3.6
112    module use /usr/share/modules/modulefiles
113    module load esys/env    # Recommended modules
114    module load doxygen/1.4.6
115  module load boost/1.33.0/python-2.4.1  module load boost/1.33.0/python-2.4.1
116  module load numarray/1.3.3  module load gmsh-1.65.0
117    module load epydoc/2.1/python-2.4.3
118    
119    # How many threads? One per CPU.
120    export OMP_NUM_THREADS=\$NCPUS
121    
122    # Run the tests
123    echo "Running the tests $target"
124    cd trunk                || finish FAILURE "Could not cd to trunk"
125    scons -j \$NCPUS $target >> $out_file 2>&1      || finish FAILURE "Could not run scons $target"
126    
127    # Run epydoc to create the python documentation
128    echo "Running epydoc"
129    export LD_LIBRARY_PATH="$PWD/lib:$LD_LIBRARY_PATH"
130    mkdir release release/doc release/doc/epydoc
131    scons api_epydoc >> $out_file 2>&1      || finish FAILURE "Could not run scons api_epydoc"
132    cd release/doc/epydoc
133    tar cf - . | ssh shake200 "cd /home/www/esys/esys13/nightly/epydoc; tar xf -"   || finish FAILURE "Could not copy epydoc to shake200"
134    cd ../../..
135    
136    echo "Cleaning up after the tests"
137    
138    # Delete files older than 60 days
139    find $WorkDir -atime +60 -exec rm -f {} \;
140    
141    finish SUCCESS "Successfully ran 'scons $target' on \`hostname\`"
142    
143    EOF
144    
145    # cd to the logs area so the PBS logs are deposited there
146    cd $WorkDir/Logs
147    
148    # Submit the job
149    . /opt/modules/default/init/sh
150    module load pbspro
151    
152  # set openmp settings  # Submit the job
153  export OMP_NUM_THREADS=4  qsub -S /bin/bash $RunDate.pbs.script.sh > /dev/null
154    
 echo "===> svn update"  
 svn update  
 if [ $? != 0 ]  
 then  
   echo "svn update failed"  
   echo "svn update failed" | mail -s "esys autotest-scons results" $MAIL_RECIPIENTS  
   exit 2  
 fi  
   
 echo "===> scons building esys"  
 scons  
 if [ $? != 0 ]  
 then  
   echo "scons build failed"  
   echo "scons build failed" | mail -s "esys autotest-scons results" $MAIL_RECIPIENTS  
   exit 3  
 fi  
   
 echo "===> building unit_tests"  
 scons build_all_tests  
 if [ $? != 0 ]  
 then  
   echo "build_tests failed"  
   echo "build_tests failed" | mail -s "esys autotest-scons results" $MAIL_RECIPIENTS  
   exit 3  
 fi  
   
 FAIL=0  
   
 echo "===> running unit_tests"  
 scons run_all_tests  
 if [ $? != 0 ]  
 then  
   echo "run_all_tests failed"  
   echo "run_all_tests failed" | mail -s "esys autotest-scons results" $MAIL_RECIPIENTS  
   exit 4  
 fi  

Legend:
Removed from v.707  
changed lines
  Added in v.1388

  ViewVC Help
Powered by ViewVC 1.1.26