/[escript]/temp/autotest-scons
ViewVC logotype

Diff of /temp/autotest-scons

Parent Directory Parent Directory | Revision Log Revision Log | View Patch Patch

revision 344 by svn, Tue Dec 13 05:17:32 2005 UTC revision 707 by gross, Wed Apr 12 23:58:02 2006 UTC
# Line 1  Line 1 
1  #!/bin/bash  #!/bin/bash
2    #          Copyright 2006 by ACcESS MNRF
3    #
4    #              http://www.access.edu.au
5    #       Primary Business: Queensland, Australia
6    #  Licensed under the Open Software License version 3.0
7    #     http://www.opensource.org/licenses/osl-3.0.php
8    #
9    #
10    #
11  # $Id: autotest-scons 162 2005-11-11 00:09:59Z svn $  # $Id: autotest-scons 162 2005-11-11 00:09:59Z svn $
12  # An explicit testing script for esys using the scons build system  # An explicit testing script for esys using the scons build system
13    
14  # list of users to email test results to  # list of users to email test results to
15  MAIL_RECIPIENTS="jgs@esscc.uq.edu.au gross@esscc.uq.edu.au cochrane@esscc.uq.edu.au elspeth@esscc.uq.edu.au matt@esscc.uq.edu.au"  MAIL_RECIPIENTS="gross@esscc.uq.edu.au elspeth@esscc.uq.edu.au matt@esscc.uq.edu.au robert.woodcock@csiro.au Peter.Hornby@csiro.au"
   
 # modules to test  
 TESTS="escript bruce finley"  
16    
17  # the python tests to run  # the python tests to run
18  FINLEY_PYTESTS="ImportTest.py finleyTest.py SimpleSolve.py GradTest.py RecTest.py test_linearPDEsOnFinley.py test_generators.py test_visualization_interface.py test_utilOnFinley.py test_symbolsOnFinley.py"  BRUCE_PYTESTS="ImportTest.passed BruceTest.passed test_utilOnBruce.py"
19  ESCRIPT_PYTESTS="ImportTest.py BinaryOps.py UnaryOps.py SliceGetting.py SliceSetting.py MiscTests.py ArchiveTests.py escriptTest.py newEscriptTests.py DataVariableTests.py test_xml.py"  ESCRIPT_PYTESTS="ImportTest.passed BinaryOps.passed UnaryOps.passed SliceGetting.passed SliceSetting.passed MiscTests.passed ArchiveTests.passed newEscriptTests.passed test_xml.passed insituTests.passed s2.passed"
20  BRUCE_PYTESTS="ImportTest.py BruceTest.py test_utilOnBruce.py test_symbolsOnBruce.py"  FINLEY_PYTESTS="ImportTest.passed finleyTest.passed SimpleSolve.passed RecTest.passed test_linearPDEsOnFinley.passed test_generators.passed test_visualization_interface.passed test_utilOnFinley.passed"
   
 PWD=`pwd`  
 echo working in: $PWD  
21    
22  # define compiler executable and library locations  echo "===> cd $1"
 export PATH=/opt/intel/cmplrs/80.058/intel_cc_80/bin:$PATH  
 export LD_LIBRARY_PATH=/opt/intel/cmplrs/80.058/intel_cc_80/lib  
   
 # define python location  
 export PATH=/raid2/tools/python-2.3.4/bin:$PATH  
   
 # set library and openmp settings  
 export LD_LIBRARY_PATH=$PWD/lib:/raid2/tools/boost/lib:$LD_LIBRARY_PATH  
 export PYTHONPATH=$PWD  
 export OMP_SCHEDULE="dynamic"  
 export OMP_NUM_THREADS=4  
 export OMP_DYNAMIC=TRUE  
 export OMP_NESTED=FALSE  
   
 FAIL=0  
   
 echo cd $1  
23  cd $1  cd $1
24  if [ $? != 0 ]  if [ $? != 0 ]
25  then  then
26    echo couldnt cd $1    echo "couldnt cd $1"
27    echo "couldnt cd $1" | mail -s "esys autotest-scons results" $MAIL_RECIPIENTS    echo "couldnt cd $1" | mail -s "esys autotest-scons results" $MAIL_RECIPIENTS
28    exit 1    exit 1
29  fi  fi
30    
31  echo running svn update  PWD=`pwd`
32    echo "===> working in: $PWD"
33    
34    # Setup the environment
35    . ${MODULESHOME}/init/sh
36    module load intel_cc.9.0.026
37    export MODULEPATH=${MODULEPATH}:/data/raid2/toolspp4/modulefiles/gcc-3.3.6
38    module load python/2.4.1
39    module load boost/1.33.0/python-2.4.1
40    module load numarray/1.3.3
41    
42    # set openmp settings
43    export OMP_NUM_THREADS=4
44    
45    echo "===> svn update"
46  svn update  svn update
47  if [ $? != 0 ]  if [ $? != 0 ]
48  then  then
49    echo svn update failed    echo "svn update failed"
50    echo "svn update failed" | mail -s "esys autotest-scons results" $MAIL_RECIPIENTS    echo "svn update failed" | mail -s "esys autotest-scons results" $MAIL_RECIPIENTS
51    exit 2    exit 2
52  fi  fi
53    
54  echo running scons debug=1  echo "===> scons building esys"
55  scons debug=1  scons
56  if [ $? != 0 ]  if [ $? != 0 ]
57  then  then
58    echo scons failed    echo "scons build failed"
59    echo "scons failed - see autotest-scons logfile" | mail -s "esys autotest-scons results" $MAIL_RECIPIENTS    echo "scons build failed" | mail -s "esys autotest-scons results" $MAIL_RECIPIENTS
60    exit 3    exit 3
61  fi  fi
62    
63  echo running bruce unit_tests  echo "===> building unit_tests"
64  cd bruce/test  scons build_all_tests
 ./unit_test-scons  
65  if [ $? != 0 ]  if [ $? != 0 ]
66  then  then
67    echo bruce unit_test failed    echo "build_tests failed"
68    echo "bruce unit_test failed - see autotest-scons logfile" | mail -s "esys autotest-scons results" $MAIL_RECIPIENTS    echo "build_tests failed" | mail -s "esys autotest-scons results" $MAIL_RECIPIENTS
69    FAIL=1    exit 3
 fi  
 cd ../..  
   
 echo running escript unit_tests  
 cd escript/test  
 ./unit_test-scons  
 if [ $? != 0 ]  
 then  
   echo escript unit_test failed  
   echo "escript unit_test failed - see autotest-scons logfile" | mail -s "esys autotest-scons results" $MAIL_RECIPIENTS  
   FAIL=1  
70  fi  fi
 cd ../..  
71    
72  echo running finley unit_tests  FAIL=0
 cd finley/test  
 ./unit_test-scons  
 if [ $? != 0 ]  
 then  
   echo finley unit_test failed  
   echo "finley unit_test failed - see autotest-scons logfile" | mail -s "esys autotest-scons results" $MAIL_RECIPIENTS  
   FAIL=1  
 fi  
 cd ../..  
73    
74  echo running esysUtils unit_tests  echo "===> running unit_tests"
75  cd esysUtils/test  scons run_all_tests
 ./unit_test-scons  
76  if [ $? != 0 ]  if [ $? != 0 ]
77  then  then
78    echo esysUtils unit_test failed    echo "run_all_tests failed"
79    echo "esysUtils unit_test failed - see autotest-scons logfile" | mail -s "esys autotest-scons results" $MAIL_RECIPIENTS    echo "run_all_tests failed" | mail -s "esys autotest-scons results" $MAIL_RECIPIENTS
80    FAIL=1    exit 4
 fi  
 cd ../..  
   
 for module in $TESTS  
 do  
     echo "running python tests for: $module"  
     cd $module/test/python  
     if [ "$module" == "finley" ]  
     then  
         for pytest in $FINLEY_PYTESTS  
         do  
             echo "Running python test: $pytest"  
             python $pytest  
             if [ $? != 0 ]  
             then  
               echo Python Testing FAILED for $pytest in module $module  
               echo "finley py_test: $pytest failed - see autotest-scons logfile" | mail -s "esys autotest-scons results" $MAIL_RECIPIENTS  
               FAIL=1  
             fi  
         done  
     elif [ "$module" == "escript" ]  
     then  
         for pytest in $ESCRIPT_PYTESTS  
         do  
             echo "Running python test: $pytest"  
             python $pytest  
             if [ $? != 0 ]  
             then  
               echo Python Testing FAILED for $pytest in module $module  
               echo "escript py_test: $pytest failed - see autotest-scons logfile" | mail -s "esys autotest-scons results" $MAIL_RECIPIENTS  
               FAIL=1  
             fi  
         done  
     elif [ "$module" == "bruce" ]  
     then  
         for pytest in $BRUCE_PYTESTS  
         do  
             echo "Running python test: $pytest"  
             python $pytest  
             if [ $? != 0 ]  
             then  
               echo Python Testing FAILED for $pytest in module $module  
               echo "bruce py_test: $pytest failed - see autotest-scons logfile" | mail -s "esys autotest-scons results" $MAIL_RECIPIENTS  
               FAIL=1  
             fi  
         done  
     fi  
     cd ../../..  
 done  
   
 if [ $FAIL == 0 ]  
 then  
     echo success  
     echo "success" | mail -s "esys autotest-scons results" $MAIL_RECIPIENTS  
81  fi  fi
 exit 0  

Legend:
Removed from v.344  
changed lines
  Added in v.707

  ViewVC Help
Powered by ViewVC 1.1.26