/[escript]/trunk/autotest-scons
ViewVC logotype

Diff of /trunk/autotest-scons

Parent Directory Parent Directory | Revision Log Revision Log | View Patch Patch

revision 321 by jgs, Tue Dec 6 04:46:50 2005 UTC revision 683 by robwdcock, Mon Mar 27 05:46:50 2006 UTC
# Line 1  Line 1 
1  #!/bin/bash  #!/bin/bash
2    
3  # $Id: autotest 162 2005-11-11 00:09:59Z svn $  # $Id: autotest-scons 162 2005-11-11 00:09:59Z svn $
4  # An explicit testing script for esys using the scons build system  # An explicit testing script for esys using the scons build system
5    
6  # list of users to email test results to  # list of users to email test results to
7  #MAIL_RECIPIENTS="jgs@esscc.uq.edu.au gross@esscc.uq.edu.au cochrane@esscc.uq.edu.au elspeth@esscc.uq.edu.au matt@esscc.uq.edu.au"  MAIL_RECIPIENTS="gross@esscc.uq.edu.au elspeth@esscc.uq.edu.au matt@esscc.uq.edu.au robert.woodcock@csiro.au Peter.Hornby@csiro.au"
 MAIL_RECIPIENTS="jgs@esscc.uq.edu.au"  
   
 #modules to test  
 TESTS="escript bruce finley"  
8    
9  # the python tests to run  # the python tests to run
10  FINLEY_PYTESTS="ImportTest.py SimpleSolve.py GradTest.py test_linearPDEsOnFinley.py test_generators.py test_visualization_interface.py test_utilOnFinley.py test_symbolsOnFinley.py"  BRUCE_PYTESTS="ImportTest.passed BruceTest.passed test_utilOnBruce.py"
11  ESCRIPT_PYTESTS="ImportTest.py BinaryOps.py UnaryOps.py SliceGetting.py SliceSetting.py MiscTests.py newEscriptTests.py DataVariableTests.py test_xml.py"  ESCRIPT_PYTESTS="ImportTest.passed BinaryOps.passed UnaryOps.passed SliceGetting.passed SliceSetting.passed MiscTests.passed ArchiveTests.passed newEscriptTests.passed test_xml.passed insituTests.passed s2.passed"
12  BRUCE_PYTESTS="ImportTest.py BruceTest.py test_utilOnBruce.py test_symbolsOnBruce.py"  FINLEY_PYTESTS="ImportTest.passed finleyTest.passed SimpleSolve.passed RecTest.passed test_linearPDEsOnFinley.passed test_generators.passed test_visualization_interface.passed test_utilOnFinley.passed"
   
   
 # define compiler executable and library locations  
 export PATH=/opt/intel/cmplrs/80.058/intel_cc_80/bin:$PATH  
 export LD_LIBRARY_PATH=/opt/intel/cmplrs/80.058/intel_cc_80/lib  
13    
14  echo cd $1  echo "===> cd $1"
15  cd $1  cd $1
16  if [ $? != 0 ]  if [ $? != 0 ]
17  then  then
18    echo couldnt cd $1    echo "couldnt cd $1"
19    echo "couldnt cd $1" | mail -s "esys autotest results" $MAIL_RECIPIENTS    echo "couldnt cd $1" | mail -s "esys autotest-scons results" $MAIL_RECIPIENTS
20    exit 1    exit 1
21  fi  fi
22    
23  echo loading esys setup  PWD=`pwd`
24  . ~jgs/bin/scons_setup  echo "===> working in: $PWD"
25    
26    # Setup the environment
27    . ${MODULESHOME}/init/sh
28    module load intel_cc.9.0.026
29    export MODULEPATH=${MODULEPATH}:/data/raid2/toolspp4/modulefiles/gcc-3.3.6
30    module load boost/1.33.0/python-2.4.1
31    module load python/2.4.1
32    module load numarray/1.3.3
33    
34    # set openmp settings
35    export OMP_SCHEDULE="dynamic"
36    export OMP_NUM_THREADS=4
37    export OMP_DYNAMIC=TRUE
38    export OMP_NESTED=FALSE
39    
40    echo "===> svn update"
41    svn update
42  if [ $? != 0 ]  if [ $? != 0 ]
43  then  then
44    echo couldnt load scons setup    echo "svn update failed"
45    echo "couldnt load scons setup" | mail -s "esys autotest results" $MAIL_RECIPIENTS    echo "svn update failed" | mail -s "esys autotest-scons results" $MAIL_RECIPIENTS
46    exit 2    exit 2
47  fi  fi
48    
49  echo running svn update  echo "===> scons building esys"
50  svn update  scons
51  if [ $? != 0 ]  if [ $? != 0 ]
52  then  then
53    echo svn update failed    echo "scons build failed"
54    echo "svn update failed" | mail -s "esys autotest results" $MAIL_RECIPIENTS    echo "scons build failed" | mail -s "esys autotest-scons results" $MAIL_RECIPIENTS
55    exit 3    exit 3
56  fi  fi
57    
58  echo running scons debug=1  echo "===> building unit_tests"
59  scons debug=1  scons build_tests
60  if [ $? != 0 ]  if [ $? != 0 ]
61  then  then
62    echo scons failed    echo "unit_test build failed"
63    echo "scons failed - see autotest logfile" | mail -s "esys autotest results" $MAIL_RECIPIENTS    echo "unit_test build failed" | mail -s "esys autotest-scons results" $MAIL_RECIPIENTS
64    exit 5    exit 3
65  fi  fi
66    
67  echo running bruce unit_tests  FAIL=0
68  cd bruce/test  
69  ./unit_test-scons  echo "===> running unit_tests"
70  if [ $? != 0 ]  scons run_tests
 then  
   echo bruce unit_test failed  
   echo "bruce unit_test failed - see autotest logfile" | mail -s "esys autotest results" $MAIL_RECIPIENTS  
   exit 6  
 fi  
 cd ../..  
   
 echo running escript unit_tests  
 cd escript/test  
 ./unit_test-scons  
 if [ $? != 0 ]  
 then  
   echo escript unit_test failed  
   echo "escript unit_test failed - see autotest logfile" | mail -s "esys autotest results" $MAIL_RECIPIENTS  
   exit 6  
 fi  
 cd ../..  
   
 echo running finley unit_tests  
 cd finley/test  
 ./unit_test-scons  
71  if [ $? != 0 ]  if [ $? != 0 ]
72  then  then
73    echo finley unit_test failed    echo "unit_testing failed"
74    echo "finley unit_test failed - see autotest logfile" | mail -s "esys autotest results" $MAIL_RECIPIENTS    echo "unit_test failed" | mail -s "esys autotest-scons results" $MAIL_RECIPIENTS
75    exit 6    FAIL=1
76  fi  fi
 cd ../..  
77    
78  for module in $TESTS  for pytest in $ESCRIPT_PYTESTS
79    do
80      echo "===>running escript python test: $pytest"
81      scons build/posix/escript/test/python/$pytest
82      if [ $? != 0 ]
83      then
84        echo "python testing failed for $pytest in module $module"
85        echo "escript py_test: $pytest failed" | mail -s "esys autotest-scons results" $MAIL_RECIPIENTS
86        FAIL=1
87      fi
88    done
89    
90    for pytest in $FINLEY_PYTESTS
91  do  do
92      echo "running python tests for: $module"    echo "running finley python test: $pytest"
93      cd $module/test/python    scons build/posix/finley/test/python/$pytest
94      if [ "$module" == "finley" ]    if [ $? != 0 ]
95      then    then
96          for pytest in $FINLEY_PYTESTS      echo "python testing failed for $pytest in module $module"
97          do      echo "finley py_test: $pytest failed" | mail -s "esys autotest-scons results" $MAIL_RECIPIENTS
98              echo "Running python test: $pytest"      FAIL=1
99              python $pytest    fi
             if [ $? != 0 ]  
             then  
               echo Python Testing FAILED for $pytest in module $module  
               exit 1  
             fi  
         done  
     elif [ "$module" == "escript" ]  
     then  
         for pytest in $ESCRIPT_PYTESTS  
         do  
             echo "Running python test: $pytest"  
             python $pytest  
             if [ $? != 0 ]  
             then  
               echo Python Testing FAILED for $pytest in module $module  
               exit 1  
             fi  
         done  
     elif [ "$module" == "bruce" ]  
     then  
         for pytest in $BRUCE_PYTESTS  
         do  
             echo "Running python test: $pytest"  
             python $pytest  
             if [ $? != 0 ]  
             then  
               echo Python Testing FAILED for $pytest in module $module  
               exit 1  
             fi  
         done  
     fi  
     cd ../..  
100  done  done
101    
102  echo "success" | mail -s "esys autotest results" $MAIL_RECIPIENTS  for pytest in $BRUCE_PYTESTS
103    do
104      echo "running bruce python test: $pytest"
105      scons build/posix/bruce/test/python/$pytest
106      if [ $? != 0 ]
107      then
108        echo "python testing failed for $pytest in module $module"
109        echo "bruce py_test: $pytest failed" | mail -s "esys autotest-scons results" $MAIL_RECIPIENTS
110        FAIL=1
111      fi
112    done
113    
114    if [ $FAIL == 0 ]
115    then
116        echo success
117        echo "success" | mail -s "esys autotest-scons results" $MAIL_RECIPIENTS
118    fi
119  exit 0  exit 0

Legend:
Removed from v.321  
changed lines
  Added in v.683

  ViewVC Help
Powered by ViewVC 1.1.26