/[escript]/trunk/autotest-scons
ViewVC logotype

Diff of /trunk/autotest-scons

Parent Directory Parent Directory | Revision Log Revision Log | View Patch Patch

revision 361 by jgs, Thu Dec 15 02:04:58 2005 UTC revision 523 by gross, Tue Feb 14 05:54:41 2006 UTC
# Line 4  Line 4 
4  # An explicit testing script for esys using the scons build system  # An explicit testing script for esys using the scons build system
5    
6  # list of users to email test results to  # list of users to email test results to
7  MAIL_RECIPIENTS="jgs@esscc.uq.edu.au gross@esscc.uq.edu.au cochrane@esscc.uq.edu.au elspeth@esscc.uq.edu.au matt@esscc.uq.edu.au"  MAIL_RECIPIENTS="jgs@esscc.uq.edu.au gross@esscc.uq.edu.au elspeth@esscc.uq.edu.au matt@esscc.uq.edu.au"
 #MAIL_RECIPIENTS="jgs@esscc.uq.edu.au"  
   
 # modules to test  
 TESTS="escript bruce finley"  
8    
9  # the python tests to run  # the python tests to run
10  FINLEY_PYTESTS="ImportTest.py finleyTest.py SimpleSolve.py GradTest.py RecTest.py test_linearPDEsOnFinley.py test_generators.py test_visualization_interface.py test_utilOnFinley.py test_symbolsOnFinley.py"  BRUCE_PYTESTS="ImportTest.py BruceTest.py test_utilOnBruce.py"
11  ESCRIPT_PYTESTS="ImportTest.py BinaryOps.py UnaryOps.py SliceGetting.py SliceSetting.py MiscTests.py ArchiveTests.py escriptTest.py newEscriptTests.py DataVariableTests.py test_xml.py"  ESCRIPT_PYTESTS="ImportTest.py BinaryOps.py UnaryOps.py SliceGetting.py SliceSetting.py MiscTests.py ArchiveTests.py newEscriptTests.py DataVariableTests.py test_xml.py insituTests.py s2.py"
12  BRUCE_PYTESTS="ImportTest.py BruceTest.py test_utilOnBruce.py test_symbolsOnBruce.py"  FINLEY_PYTESTS="ImportTest.py finleyTest.py SimpleSolve.py RecTest.py test_linearPDEsOnFinley.py test_generators.py test_visualization_interface.py test_utilOnFinley.py"
13    
14  echo cd $1  echo "===> cd $1"
15  cd $1  cd $1
16  if [ $? != 0 ]  if [ $? != 0 ]
17  then  then
18    echo couldnt cd $1    echo "couldnt cd $1"
19    echo "couldnt cd $1" | mail -s "esys autotest-scons results" $MAIL_RECIPIENTS    echo "couldnt cd $1" | mail -s "esys autotest-scons results" $MAIL_RECIPIENTS
20    exit 1    exit 1
21  fi  fi
22    
23  PWD=`pwd`  PWD=`pwd`
24  echo working in: $PWD  echo "===> working in: $PWD"
25    
26  # define compiler executable and library locations  # define compiler executable and library locations
27  export PATH=/opt/intel/cmplrs/80.058/intel_cc_80/bin:$PATH  export PATH=/opt/intel/cmplrs/80.058/intel_cc_80/bin:$PATH
# Line 34  export LD_LIBRARY_PATH=/opt/intel/cmplrs Line 30  export LD_LIBRARY_PATH=/opt/intel/cmplrs
30  # define python location  # define python location
31  export PATH=/raid2/tools/python-2.3.4/bin:$PATH  export PATH=/raid2/tools/python-2.3.4/bin:$PATH
32    
33  # set library and openmp settings  # set library and python paths
34  export LD_LIBRARY_PATH=$PWD/lib:/raid2/tools/boost/lib:$LD_LIBRARY_PATH  export LD_LIBRARY_PATH=$PWD/lib:/raid2/tools/boost/lib:$LD_LIBRARY_PATH
35  export PYTHONPATH=$PWD  export PYTHONPATH=$PWD
36    
37    # set openmp settings
38  export OMP_SCHEDULE="dynamic"  export OMP_SCHEDULE="dynamic"
39  export OMP_NUM_THREADS=4  export OMP_NUM_THREADS=4
40  export OMP_DYNAMIC=TRUE  export OMP_DYNAMIC=TRUE
41  export OMP_NESTED=FALSE  export OMP_NESTED=FALSE
42    
43  FAIL=0  echo "===> svn update"
   
 echo svn update  
44  svn update  svn update
45  if [ $? != 0 ]  if [ $? != 0 ]
46  then  then
47    echo svn update failed    echo "svn update failed"
48    echo "svn update failed" | mail -s "esys autotest-scons results" $MAIL_RECIPIENTS    echo "svn update failed" | mail -s "esys autotest-scons results" $MAIL_RECIPIENTS
49    exit 2    exit 2
50  fi  fi
51    
52  echo building scons debug=1  echo "===> scons building esys"
53  scons debug=1  scons
54  if [ $? != 0 ]  if [ $? != 0 ]
55  then  then
56    echo scons build failed    echo "scons build failed"
57    echo "scons build failed - see autotest-scons logfile" | mail -s "esys autotest-scons results" $MAIL_RECIPIENTS    echo "scons build failed" | mail -s "esys autotest-scons results" $MAIL_RECIPIENTS
58    exit 3    exit 3
59  fi  fi
60    
61  echo building unit_tests  echo "===> building unit_tests"
62  scons debug=1 build_tests  scons build_tests
63  if [ $? != 0 ]  if [ $? != 0 ]
64  then  then
65    echo  unit_test build failed    echo "unit_test build failed"
66    echo "unit_test build failed - see autotest-scons logfile" | mail -s "esys autotest-scons results" $MAIL_RECIPIENTS    echo "unit_test build failed" | mail -s "esys autotest-scons results" $MAIL_RECIPIENTS
67    exit 3    exit 3
68  fi  fi
69    
70  echo running unit_tests  FAIL=0
71  scons debug=1 run_tests  
72    echo "===> running unit_tests"
73    scons run_tests
74  if [ $? != 0 ]  if [ $? != 0 ]
75  then  then
76    echo unit_testing failed    echo "unit_testing failed"
77    echo "unit_test failed - see autotest-scons logfile" | mail -s "esys autotest-scons results" $MAIL_RECIPIENTS    echo "unit_test failed" | mail -s "esys autotest-scons results" $MAIL_RECIPIENTS
78    FAIL=1    FAIL=1
79  fi  fi
80    
81  for module in $TESTS  cd escript/test/python
82    for pytest in $ESCRIPT_PYTESTS
83    do
84      echo "===>running escript python test: $pytest"
85      python $pytest
86      if [ $? != 0 ]
87      then
88        echo "python testing failed for $pytest in module $module"
89        echo "escript py_test: $pytest failed" | mail -s "esys autotest-scons results" $MAIL_RECIPIENTS
90        FAIL=1
91      fi
92    done
93    cd ../../..
94    
95    cd finley/test/python
96    for pytest in $FINLEY_PYTESTS
97    do
98      echo "running finley python test: $pytest"
99      python $pytest
100      if [ $? != 0 ]
101      then
102        echo "python testing failed for $pytest in module $module"
103        echo "finley py_test: $pytest failed" | mail -s "esys autotest-scons results" $MAIL_RECIPIENTS
104        FAIL=1
105      fi
106    done
107    cd ../../..
108    
109    cd bruce/test/python
110    for pytest in $BRUCE_PYTESTS
111  do  do
112      echo "running python tests for: $module"    echo "running bruce python test: $pytest"
113      cd $module/test/python    python $pytest
114      if [ "$module" == "finley" ]    if [ $? != 0 ]
115      then    then
116          for pytest in $FINLEY_PYTESTS      echo "python testing failed for $pytest in module $module"
117          do      echo "bruce py_test: $pytest failed" | mail -s "esys autotest-scons results" $MAIL_RECIPIENTS
118              echo "Running python test: $pytest"      FAIL=1
119              python $pytest    fi
             if [ $? != 0 ]  
             then  
               echo Python Testing FAILED for $pytest in module $module  
               echo "finley py_test: $pytest failed - see autotest-scons logfile" | mail -s "esys autotest-scons results" $MAIL_RECIPIENTS  
               FAIL=1  
             fi  
         done  
     elif [ "$module" == "escript" ]  
     then  
         for pytest in $ESCRIPT_PYTESTS  
         do  
             echo "Running python test: $pytest"  
             python $pytest  
             if [ $? != 0 ]  
             then  
               echo Python Testing FAILED for $pytest in module $module  
               echo "escript py_test: $pytest failed - see autotest-scons logfile" | mail -s "esys autotest-scons results" $MAIL_RECIPIENTS  
               FAIL=1  
             fi  
         done  
     elif [ "$module" == "bruce" ]  
     then  
         for pytest in $BRUCE_PYTESTS  
         do  
             echo "Running python test: $pytest"  
             python $pytest  
             if [ $? != 0 ]  
             then  
               echo Python Testing FAILED for $pytest in module $module  
               echo "bruce py_test: $pytest failed - see autotest-scons logfile" | mail -s "esys autotest-scons results" $MAIL_RECIPIENTS  
               FAIL=1  
             fi  
         done  
     fi  
     cd ../../..  
120  done  done
121    cd ../../..
122    
123  if [ $FAIL == 0 ]  if [ $FAIL == 0 ]
124  then  then

Legend:
Removed from v.361  
changed lines
  Added in v.523

  ViewVC Help
Powered by ViewVC 1.1.26