/[escript]/trunk/autotest-scons
ViewVC logotype

Diff of /trunk/autotest-scons

Parent Directory Parent Directory | Revision Log Revision Log | View Patch Patch

revision 361 by jgs, Thu Dec 15 02:04:58 2005 UTC revision 700 by gross, Thu Apr 6 00:13:40 2006 UTC
# Line 4  Line 4 
4  # An explicit testing script for esys using the scons build system  # An explicit testing script for esys using the scons build system
5    
6  # list of users to email test results to  # list of users to email test results to
7  MAIL_RECIPIENTS="jgs@esscc.uq.edu.au gross@esscc.uq.edu.au cochrane@esscc.uq.edu.au elspeth@esscc.uq.edu.au matt@esscc.uq.edu.au"  MAIL_RECIPIENTS="gross@esscc.uq.edu.au elspeth@esscc.uq.edu.au matt@esscc.uq.edu.au robert.woodcock@csiro.au Peter.Hornby@csiro.au"
 #MAIL_RECIPIENTS="jgs@esscc.uq.edu.au"  
   
 # modules to test  
 TESTS="escript bruce finley"  
8    
9  # the python tests to run  # the python tests to run
10  FINLEY_PYTESTS="ImportTest.py finleyTest.py SimpleSolve.py GradTest.py RecTest.py test_linearPDEsOnFinley.py test_generators.py test_visualization_interface.py test_utilOnFinley.py test_symbolsOnFinley.py"  BRUCE_PYTESTS="ImportTest.passed BruceTest.passed test_utilOnBruce.py"
11  ESCRIPT_PYTESTS="ImportTest.py BinaryOps.py UnaryOps.py SliceGetting.py SliceSetting.py MiscTests.py ArchiveTests.py escriptTest.py newEscriptTests.py DataVariableTests.py test_xml.py"  ESCRIPT_PYTESTS="ImportTest.passed BinaryOps.passed UnaryOps.passed SliceGetting.passed SliceSetting.passed MiscTests.passed ArchiveTests.passed newEscriptTests.passed test_xml.passed insituTests.passed s2.passed"
12  BRUCE_PYTESTS="ImportTest.py BruceTest.py test_utilOnBruce.py test_symbolsOnBruce.py"  FINLEY_PYTESTS="ImportTest.passed finleyTest.passed SimpleSolve.passed RecTest.passed test_linearPDEsOnFinley.passed test_generators.passed test_visualization_interface.passed test_utilOnFinley.passed"
13    
14  echo cd $1  echo "===> cd $1"
15  cd $1  cd $1
16  if [ $? != 0 ]  if [ $? != 0 ]
17  then  then
18    echo couldnt cd $1    echo "couldnt cd $1"
19    echo "couldnt cd $1" | mail -s "esys autotest-scons results" $MAIL_RECIPIENTS    echo "couldnt cd $1" | mail -s "esys autotest-scons results" $MAIL_RECIPIENTS
20    exit 1    exit 1
21  fi  fi
22    
23  PWD=`pwd`  PWD=`pwd`
24  echo working in: $PWD  echo "===> working in: $PWD"
25    
26  # define compiler executable and library locations  # Setup the environment
27  export PATH=/opt/intel/cmplrs/80.058/intel_cc_80/bin:$PATH  . ${MODULESHOME}/init/sh
28  export LD_LIBRARY_PATH=/opt/intel/cmplrs/80.058/intel_cc_80/lib  module load intel_cc.9.0.026
29    export MODULEPATH=${MODULEPATH}:/data/raid2/toolspp4/modulefiles/gcc-3.3.6
30  # define python location  module load boost/1.33.0/python-2.4.1
31  export PATH=/raid2/tools/python-2.3.4/bin:$PATH  module load python/2.4.1
32    module load numarray/1.3.3
 # set library and openmp settings  
 export LD_LIBRARY_PATH=$PWD/lib:/raid2/tools/boost/lib:$LD_LIBRARY_PATH  
 export PYTHONPATH=$PWD  
 export OMP_SCHEDULE="dynamic"  
 export OMP_NUM_THREADS=4  
 export OMP_DYNAMIC=TRUE  
 export OMP_NESTED=FALSE  
33    
34  FAIL=0  # set openmp settings
35    export OMP_NUM_THREADS=4
36    
37  echo svn update  echo "===> svn update"
38  svn update  svn update
39  if [ $? != 0 ]  if [ $? != 0 ]
40  then  then
41    echo svn update failed    echo "svn update failed"
42    echo "svn update failed" | mail -s "esys autotest-scons results" $MAIL_RECIPIENTS    echo "svn update failed" | mail -s "esys autotest-scons results" $MAIL_RECIPIENTS
43    exit 2    exit 2
44  fi  fi
45    
46  echo building scons debug=1  echo "===> scons building esys"
47  scons debug=1  scons
48  if [ $? != 0 ]  if [ $? != 0 ]
49  then  then
50    echo scons build failed    echo "scons build failed"
51    echo "scons build failed - see autotest-scons logfile" | mail -s "esys autotest-scons results" $MAIL_RECIPIENTS    echo "scons build failed" | mail -s "esys autotest-scons results" $MAIL_RECIPIENTS
52    exit 3    exit 3
53  fi  fi
54    
55  echo building unit_tests  echo "===> building unit_tests"
56  scons debug=1 build_tests  scons build_tests
57  if [ $? != 0 ]  if [ $? != 0 ]
58  then  then
59    echo  unit_test build failed    echo "unit_test build failed"
60    echo "unit_test build failed - see autotest-scons logfile" | mail -s "esys autotest-scons results" $MAIL_RECIPIENTS    echo "unit_test build failed" | mail -s "esys autotest-scons results" $MAIL_RECIPIENTS
61    exit 3    exit 3
62  fi  fi
63    
64  echo running unit_tests  FAIL=0
65  scons debug=1 run_tests  
66    echo "===> running unit_tests"
67    scons run_tests
68  if [ $? != 0 ]  if [ $? != 0 ]
69  then  then
70    echo unit_testing failed    echo "unit_testing failed"
71    echo "unit_test failed - see autotest-scons logfile" | mail -s "esys autotest-scons results" $MAIL_RECIPIENTS    echo "unit_test failed" | mail -s "esys autotest-scons results" $MAIL_RECIPIENTS
72    FAIL=1    FAIL=1
73  fi  fi
74    
75  for module in $TESTS  exit
76    for pytest in $ESCRIPT_PYTESTS
77    do
78      echo "===>running escript python test: $pytest"
79      scons build/posix/escript/test/python/$pytest
80      if [ $? != 0 ]
81      then
82        echo "python testing failed for $pytest in module $module"
83        echo "escript py_test: $pytest failed" | mail -s "esys autotest-scons results" $MAIL_RECIPIENTS
84        FAIL=1
85      fi
86    done
87    
88    for pytest in $FINLEY_PYTESTS
89    do
90      echo "running finley python test: $pytest"
91      scons build/posix/finley/test/python/$pytest
92      if [ $? != 0 ]
93      then
94        echo "python testing failed for $pytest in module $module"
95        echo "finley py_test: $pytest failed" | mail -s "esys autotest-scons results" $MAIL_RECIPIENTS
96        FAIL=1
97      fi
98    done
99    
100    for pytest in $BRUCE_PYTESTS
101  do  do
102      echo "running python tests for: $module"    echo "running bruce python test: $pytest"
103      cd $module/test/python    scons build/posix/bruce/test/python/$pytest
104      if [ "$module" == "finley" ]    if [ $? != 0 ]
105      then    then
106          for pytest in $FINLEY_PYTESTS      echo "python testing failed for $pytest in module $module"
107          do      echo "bruce py_test: $pytest failed" | mail -s "esys autotest-scons results" $MAIL_RECIPIENTS
108              echo "Running python test: $pytest"      FAIL=1
109              python $pytest    fi
             if [ $? != 0 ]  
             then  
               echo Python Testing FAILED for $pytest in module $module  
               echo "finley py_test: $pytest failed - see autotest-scons logfile" | mail -s "esys autotest-scons results" $MAIL_RECIPIENTS  
               FAIL=1  
             fi  
         done  
     elif [ "$module" == "escript" ]  
     then  
         for pytest in $ESCRIPT_PYTESTS  
         do  
             echo "Running python test: $pytest"  
             python $pytest  
             if [ $? != 0 ]  
             then  
               echo Python Testing FAILED for $pytest in module $module  
               echo "escript py_test: $pytest failed - see autotest-scons logfile" | mail -s "esys autotest-scons results" $MAIL_RECIPIENTS  
               FAIL=1  
             fi  
         done  
     elif [ "$module" == "bruce" ]  
     then  
         for pytest in $BRUCE_PYTESTS  
         do  
             echo "Running python test: $pytest"  
             python $pytest  
             if [ $? != 0 ]  
             then  
               echo Python Testing FAILED for $pytest in module $module  
               echo "bruce py_test: $pytest failed - see autotest-scons logfile" | mail -s "esys autotest-scons results" $MAIL_RECIPIENTS  
               FAIL=1  
             fi  
         done  
     fi  
     cd ../../..  
110  done  done
111    
112  if [ $FAIL == 0 ]  if [ $FAIL == 0 ]

Legend:
Removed from v.361  
changed lines
  Added in v.700

  ViewVC Help
Powered by ViewVC 1.1.26