/[escript]/trunk/autotest-scons
ViewVC logotype

Diff of /trunk/autotest-scons

Parent Directory Parent Directory | Revision Log Revision Log | View Patch Patch

revision 330 by svn, Wed Dec 7 06:31:27 2005 UTC revision 445 by gross, Sun Jan 22 23:58:14 2006 UTC
# Line 1  Line 1 
1  #!/bin/bash  #!/bin/bash
2    
3  # $Id: autotest 162 2005-11-11 00:09:59Z svn $  # $Id: autotest-scons 162 2005-11-11 00:09:59Z svn $
4  # An explicit testing script for esys using the scons build system  # An explicit testing script for esys using the scons build system
5    
6  # list of users to email test results to  # list of users to email test results to
7  #MAIL_RECIPIENTS="jgs@esscc.uq.edu.au gross@esscc.uq.edu.au cochrane@esscc.uq.edu.au elspeth@esscc.uq.edu.au matt@esscc.uq.edu.au"  MAIL_RECIPIENTS="jgs@esscc.uq.edu.au gross@esscc.uq.edu.au cochrane@esscc.uq.edu.au elspeth@esscc.uq.edu.au matt@esscc.uq.edu.au"
 MAIL_RECIPIENTS="jgs@esscc.uq.edu.au"  
   
 #modules to test  
 TESTS="escript bruce finley"  
8    
9  # the python tests to run  # the python tests to run
 FINLEY_PYTESTS="ImportTest.py SimpleSolve.py GradTest.py test_linearPDEsOnFinley.py test_generators.py test_visualization_interface.py test_utilOnFinley.py test_symbolsOnFinley.py"  
 #ESCRIPT_PYTESTS="ImportTest.py BinaryOps.py UnaryOps.py SliceGetting.py SliceSetting.py MiscTests.py newEscriptTests.py DataVariableTests.py test_xml.py"  
 ESCRIPT_PYTESTS="ImportTest.py BinaryOps.py UnaryOps.py SliceGetting.py SliceSetting.py MiscTests.py newEscriptTests.py DataVariableTests.py"  
10  BRUCE_PYTESTS="ImportTest.py BruceTest.py test_utilOnBruce.py test_symbolsOnBruce.py"  BRUCE_PYTESTS="ImportTest.py BruceTest.py test_utilOnBruce.py test_symbolsOnBruce.py"
11    ESCRIPT_PYTESTS="ImportTest.py BinaryOps.py UnaryOps.py SliceGetting.py SliceSetting.py MiscTests.py ArchiveTests.py newEscriptTests.py DataVariableTests.py test_xml.py insituTests.py pdetoolsTest.py s2.py"
12    FINLEY_PYTESTS="ImportTest.py finleyTest.py SimpleSolve.py RecTest.py test_linearPDEsOnFinley.py test_generators.py test_visualization_interface.py test_utilOnFinley.py test_symbolsOnFinley.py"
13    
14    echo "===> cd $1"
 # define compiler executable and library locations  
 export PATH=/opt/intel/cmplrs/80.058/intel_cc_80/bin:$PATH  
 export LD_LIBRARY_PATH=/opt/intel/cmplrs/80.058/intel_cc_80/lib  
   
 echo cd $1  
15  cd $1  cd $1
16  if [ $? != 0 ]  if [ $? != 0 ]
17  then  then
18    echo couldnt cd $1    echo "couldnt cd $1"
19    echo "couldnt cd $1" | mail -s "esys autotest results" $MAIL_RECIPIENTS    echo "couldnt cd $1" | mail -s "esys autotest-scons results" $MAIL_RECIPIENTS
20    exit 1    exit 1
21  fi  fi
22    
23  echo loading esys setup  PWD=`pwd`
24  . ~jgs/bin/scons_setup  echo "===> working in: $PWD"
25    
26    # define compiler executable and library locations
27    export PATH=/opt/intel/cmplrs/80.058/intel_cc_80/bin:$PATH
28    export LD_LIBRARY_PATH=/opt/intel/cmplrs/80.058/intel_cc_80/lib
29    
30    # define python location
31    export PATH=/raid2/tools/python-2.3.4/bin:$PATH
32    
33    # set library and openmp settings
34    export LD_LIBRARY_PATH=$PWD/lib:/raid2/tools/boost/lib:$LD_LIBRARY_PATH
35    export PYTHONPATH=$PWD
36    export OMP_SCHEDULE="dynamic"
37    export OMP_NUM_THREADS=4
38    export OMP_DYNAMIC=TRUE
39    export OMP_NESTED=FALSE
40    
41    echo "===> svn update"
42    svn update
43  if [ $? != 0 ]  if [ $? != 0 ]
44  then  then
45    echo couldnt load scons setup    echo "svn update failed"
46    echo "couldnt load scons setup" | mail -s "esys autotest results" $MAIL_RECIPIENTS    echo "svn update failed" | mail -s "esys autotest-scons results" $MAIL_RECIPIENTS
47    exit 2    exit 2
48  fi  fi
49    
50  echo running svn update  echo "===> scons building esys"
51  svn update  scons debug=1
52  if [ $? != 0 ]  if [ $? != 0 ]
53  then  then
54    echo svn update failed    echo "scons build failed"
55    echo "svn update failed" | mail -s "esys autotest results" $MAIL_RECIPIENTS    echo "scons build failed" | mail -s "esys autotest-scons results" $MAIL_RECIPIENTS
56    exit 3    exit 3
57  fi  fi
58    
59  echo running scons debug=1  echo "===> building unit_tests"
60  scons debug=1  scons debug=1 build_tests
61  if [ $? != 0 ]  if [ $? != 0 ]
62  then  then
63    echo scons failed    echo "unit_test build failed"
64    echo "scons failed - see autotest logfile" | mail -s "esys autotest results" $MAIL_RECIPIENTS    echo "unit_test build failed" | mail -s "esys autotest-scons results" $MAIL_RECIPIENTS
65    exit 5    exit 3
66  fi  fi
67    
68  echo running bruce unit_tests  FAIL=0
69  cd bruce/test  
70  ./unit_test-scons  echo "===> running unit_tests"
71  if [ $? != 0 ]  scons debug=1 run_tests
 then  
   echo bruce unit_test failed  
   echo "bruce unit_test failed - see autotest logfile" | mail -s "esys autotest results" $MAIL_RECIPIENTS  
   exit 6  
 fi  
 cd ../..  
   
 echo running escript unit_tests  
 cd escript/test  
 ./unit_test-scons  
 if [ $? != 0 ]  
 then  
   echo escript unit_test failed  
   echo "escript unit_test failed - see autotest logfile" | mail -s "esys autotest results" $MAIL_RECIPIENTS  
   exit 6  
 fi  
 cd ../..  
   
 echo running finley unit_tests  
 cd finley/test  
 ./unit_test-scons  
72  if [ $? != 0 ]  if [ $? != 0 ]
73  then  then
74    echo finley unit_test failed    echo "unit_testing failed"
75    echo "finley unit_test failed - see autotest logfile" | mail -s "esys autotest results" $MAIL_RECIPIENTS    echo "unit_test failed" | mail -s "esys autotest-scons results" $MAIL_RECIPIENTS
76    exit 6    FAIL=1
77  fi  fi
 cd ../..  
   
 export LD_LIBRARY_PATH=/raid2/tools/python-2.3.4/lib:$LD_LIBRARY_PATH  
 export PYTHON_INCLUDE=/raid2/tools/python-2.3.4/include/python2.3  
 export PYTHON_LIB_PATH=/raid2/tools/python-2.3.4/lib  
 export PATH=/raid2/tools/python-2.3.4/bin:$PATH  
78    
79  for module in $TESTS  cd escript/test/python
80    for pytest in $ESCRIPT_PYTESTS
81  do  do
82      echo "running python tests for: $module"    echo "===>running escript python test: $pytest"
83      cd $module/test/python    python $pytest
84      if [ "$module" == "finley" ]    if [ $? != 0 ]
85      then    then
86          for pytest in $FINLEY_PYTESTS      echo "python testing failed for $pytest in module $module"
87          do      echo "escript py_test: $pytest failed" | mail -s "esys autotest-scons results" $MAIL_RECIPIENTS
88              echo "Running python test: $pytest"      FAIL=1
89              python $pytest    fi
             if [ $? != 0 ]  
             then  
               echo Python Testing FAILED for $pytest in module $module  
               exit 1  
             fi  
         done  
     elif [ "$module" == "escript" ]  
     then  
         for pytest in $ESCRIPT_PYTESTS  
         do  
             echo "Running python test: $pytest"  
             python $pytest  
             if [ $? != 0 ]  
             then  
               echo Python Testing FAILED for $pytest in module $module  
               exit 1  
             fi  
         done  
     elif [ "$module" == "bruce" ]  
     then  
         for pytest in $BRUCE_PYTESTS  
         do  
             echo "Running python test: $pytest"  
             python $pytest  
             if [ $? != 0 ]  
             then  
               echo Python Testing FAILED for $pytest in module $module  
               exit 1  
             fi  
         done  
     fi  
     cd ../../..  
90  done  done
91    cd ../../..
92    
93  echo "success" | mail -s "esys autotest results" $MAIL_RECIPIENTS  cd finley/test/python
94    for pytest in $FINLEY_PYTESTS
95    do
96      echo "running finley python test: $pytest"
97      python $pytest
98      if [ $? != 0 ]
99      then
100        echo "python testing failed for $pytest in module $module"
101        echo "finley py_test: $pytest failed" | mail -s "esys autotest-scons results" $MAIL_RECIPIENTS
102        FAIL=1
103      fi
104    done
105    cd ../../..
106    
107    cd bruce/test/python
108    for pytest in $BRUCE_PYTESTS
109    do
110      echo "running bruce python test: $pytest"
111      python $pytest
112      if [ $? != 0 ]
113      then
114        echo "python testing failed for $pytest in module $module"
115        echo "bruce py_test: $pytest failed" | mail -s "esys autotest-scons results" $MAIL_RECIPIENTS
116        FAIL=1
117      fi
118    done
119    cd ../../..
120    
121    if [ $FAIL == 0 ]
122    then
123        echo success
124        echo "success" | mail -s "esys autotest-scons results" $MAIL_RECIPIENTS
125    fi
126  exit 0  exit 0

Legend:
Removed from v.330  
changed lines
  Added in v.445

  ViewVC Help
Powered by ViewVC 1.1.26