/[escript]/trunk/autotest-scons
ViewVC logotype

Diff of /trunk/autotest-scons

Parent Directory Parent Directory | Revision Log Revision Log | View Patch Patch

revision 319 by jgs, Tue Dec 6 04:25:37 2005 UTC revision 739 by ksteube, Tue Jun 20 00:52:56 2006 UTC
# Line 1  Line 1 
1  #!/bin/bash  #!/bin/sh
2    
3    #
4    # Submit a PBS job to run the tests
5    #
6    #   Usage: autotest-scons       # Short testing, only C++ tests
7    #   Usage: autotest-scons run_tests # Short testing, only C++ tests
8    #   Usage: autotest-scons all_tests # Long testing, C++ and python tests
9    #
10    # Copy this somewhere and run it every day via cron
11    #
12    # This file should be maintained in SVN as esys13/trunk/autotest-scons,
13    # be sure to copy it there and commit after modification
14    #
15    
16    # TODO: should try using the entire node: scons -j $NCPUS all_tests
17    # I've been told this produces poor results...why?
18    
19    # Which tests should we run?
20    target='run_tests'  # Default scons target that runs the tests
21    test "x$1" != "x" && target="$1"
22    
23    MAIL_RECIPIENTS="gross@esscc.uq.edu.au elspeth@esscc.uq.edu.au matt@esscc.uq.edu.au robert.woodcock@csiro.au Peter.Hornby@csiro.au k.steube@uq.edu.au"
24    # MAIL_RECIPIENTS="k.steube@uq.edu.au"
25    
26    RunDate=`date '+%Y_%m_%d'`  # Time stamp for log file names
27    
28    WorkDir=/raid3/ksteube/AutoTests
29    cd $WorkDir
30    
31    # Where to put the output of scons run_tests
32    out_file="$WorkDir/Logs/$RunDate.test.output"
33    
34  # $Id: autotest 162 2005-11-11 00:09:59Z svn $  # Save the name of this script
35  # An explicit testing script for esys using the scons build system  SCRIPT_NAME=$0
36    
37  # list of users to email test results to  # Below here \$variable means I want the variable interpreted when PBS runs the job, not when the job is submitted
38  MAIL_RECIPIENTS="jgs@esscc.uq.edu.au gross@esscc.uq.edu.au cochrane@esscc.uq.edu.au elspeth@esscc.uq.edu.au matt@esscc.uq.edu.au"  # Similarly for \`...\`
39    
40    # Write the PBS script to run the tests
41    cat << EOF > Logs/$RunDate.pbs.script.sh
42    #!/bin/bash
43    
44  # define compiler executable and library locations  #PBS -q q1
45  export PATH=/opt/intel/cmplrs/80.058/intel_cc_80/bin:$PATH  #PBS -l ncpus=2
46  export LD_LIBRARY_PATH=/opt/intel/cmplrs/80.058/intel_cc_80/lib  #PBS -o $RunDate.pbs.stdout
47    #PBS -e $RunDate.pbs.stderr
48  echo cd $1  
49  cd $1  echo "PBS_JOBNAME       \$PBS_JOBNAME"
50  if [ $? != 0 ]  echo "PBS_JOBID         \$PBS_JOBID"
51  then  echo "PBS_QUEUE         \$PBS_QUEUE"
52    echo couldnt cd $1  echo "NCPUS             \$NCPUS"
53    echo "couldnt cd $1" | mail -s "esys autotest results" $MAIL_RECIPIENTS  echo "USER              \$USER"
54    exit 1  echo "PBS_O_HOST        \$PBS_O_HOST"
55  fi  echo "PBS_O_WORKDIR     \$PBS_O_WORKDIR"
56    echo "PBS_O_SHELL       \$PBS_O_SHELL"
57  echo loading esys setup  echo ""
58  . ~jgs/bin/scons_setup  echo ""
59  if [ $? != 0 ]  
60  then  
61    echo couldnt load scons setup  
62    echo "couldnt load scons setup" | mail -s "esys autotest results" $MAIL_RECIPIENTS  START=\`date '+%Y/%m/%d %H:%M'\`
63    exit 2  
64  fi  finish () {
65      END=\`date '+%Y/%m/%d %H:%M'\`
66  #echo running svn update    cat << END_MSG | mail -s "ESYS_TESTS $target $RunDate \$1" $MAIL_RECIPIENTS
67  #svn update  \$2.
68  #if [ $? != 0 ]  The tests ran from \$START to \$END.
69  #then  See the log files in $WorkDir/Logs for more information.
70  #  echo svn update failed  This mail was sent by $SCRIPT_NAME
71  #  echo "svn update failed" | mail -s "esys autotest results" $MAIL_RECIPIENTS  running as \$USER on \`hostname\`.
72  #  exit 3  END_MSG
73  #fi    test "x$1" = "FAIL" && exit 1
74  ##    exit 0
75  #echo running scons debug=1  }
76  #scons debug=1  
77  #if [ $? != 0 ]  
78  #then  cd $WorkDir             || finish FAILURE "Could not cd to WorkDir $WorkDir"
79  #  echo scons failed  
80  #  echo "scons failed - see autotest logfile" | mail -s "esys autotest results" $MAIL_RECIPIENTS  # Create an empty out_file
81  #  exit 5  cat /dev/null > $out_file       || finish FAILURE "Could not create out_file $out_file"
82  #fi  
83    umask 022
84  echo running bruce unit_tests  
85  cd bruce/test  test -d sandbox.$RunDate        && finish FAILURE "Today's sandbox already exists"
86  ./unit_test  mkdir sandbox.$RunDate          || finish FAILURE "Could not mkdir sandbox"
87  if [ $? != 0 ]  cd sandbox.$RunDate         || finish FAILURE "Could not cd to sandbox"
88  then  
89    echo bruce unit_test failed  echo "Checking out esys13/trunk"
90    echo "bruce unit_test failed - see autotest logfile" | mail -s "esys autotest results" $MAIL_RECIPIENTS  svn checkout svn+ssh://shake200.esscc.uq.edu.au/home/www_svn/repos/esys13/trunk >> $out_file 2>&1 || finish FAILURE "Could not check out esys13/trunk"
91    exit 6  
92  fi  # Load modules
93  cd ..  . /opt/modules/default/init/bash
94    module use /raid2/matt/modules/modulefiles
95  echo running escript unit_tests  module use /raid2/toolspp4/modulefiles/gcc-3.3.6
96  cd escript/test  module use /usr/share/modules/modulefiles
97  ./unit_test  module load esys/env    # Matt's recommended modules
98  if [ $? != 0 ]  module load doxygen/1.4.6
99  then  # The next line is to avoid /raid3/ksteube/AutoTests/sandbox.2006_06_17/trunk/build/posix/bruce/test/bruce_UnitTest: error while loading shared libraries: libboost_python-mt-d.so.1.33.0: cannot open shared object file: No such file or directory
100    echo escript unit_test failed  module load boost/1.33.0/python-2.4.1
101    echo "escript unit_test failed - see autotest logfile" | mail -s "esys autotest results" $MAIL_RECIPIENTS  
102    exit 6  
103  fi  # Had to request 2 CPUs, but only use one for the tests
104  cd ..  export OMP_NUM_THREADS=1
105    
106  echo running finley unit_tests  # Run the tests
107  cd finley/test  echo "Running the tests"
108  ./unit_test  cd trunk                || finish FAILURE "Could not cd to trunk"
109  if [ $? != 0 ]  scons $target >> $out_file 2>&1     || finish FAILURE "Could not run scons $target"
110  then  
111    echo finley unit_test failed  # Delete files older than 21 days
112    echo "finley unit_test failed - see autotest logfile" | mail -s "esys autotest results" $MAIL_RECIPIENTS  find $WorkDir -atime +21 -exec rm -f {} \;
113    exit 6  
114  fi  # Clean up the sandbox
115  cd ..  cd $WorkDir             || finish FAILURE "Could not cd to clean up WorkDir $WorkDir"
116    /bin/rm -rf sandbox.$RunDate        || finish FAILURE "Could not delete sandbox"
117  #echo running mk py_test  
118  #./mk py_test  finish SUCCESS "Successfully ran 'scons $target', see Logs in $WorkDir on ess"
119  #if [ $? != 0 ]  
120  #then  EOF
121  #  echo ./mk py_test failed  
122  #  echo "./mk py_test failed - see autotest logfile" | mail -s "esys autotest results" $MAIL_RECIPIENTS  # cd to the logs area so the PBS logs are deposited there
123  #  exit 7  cd $WorkDir/Logs
124  #fi  
125    # Submit the job
126    . /opt/modules/default/init/sh
127    module load pbspro
128    qsub -S /bin/bash $RunDate.pbs.script.sh > /dev/null
129    
 echo "success" | mail -s "esys autotest results" $MAIL_RECIPIENTS  
 exit 0  

Legend:
Removed from v.319  
changed lines
  Added in v.739

  ViewVC Help
Powered by ViewVC 1.1.26