/[escript]/trunk/autotest-scons
ViewVC logotype

Diff of /trunk/autotest-scons

Parent Directory Parent Directory | Revision Log Revision Log | View Patch Patch

revision 683 by robwdcock, Mon Mar 27 05:46:50 2006 UTC revision 739 by ksteube, Tue Jun 20 00:52:56 2006 UTC
# Line 1  Line 1 
1    #!/bin/sh
2    
3    #
4    # Submit a PBS job to run the tests
5    #
6    #   Usage: autotest-scons       # Short testing, only C++ tests
7    #   Usage: autotest-scons run_tests # Short testing, only C++ tests
8    #   Usage: autotest-scons all_tests # Long testing, C++ and python tests
9    #
10    # Copy this somewhere and run it every day via cron
11    #
12    # This file should be maintained in SVN as esys13/trunk/autotest-scons,
13    # be sure to copy it there and commit after modification
14    #
15    
16    # TODO: should try using the entire node: scons -j $NCPUS all_tests
17    # I've been told this produces poor results...why?
18    
19    # Which tests should we run?
20    target='run_tests'  # Default scons target that runs the tests
21    test "x$1" != "x" && target="$1"
22    
23    MAIL_RECIPIENTS="gross@esscc.uq.edu.au elspeth@esscc.uq.edu.au matt@esscc.uq.edu.au robert.woodcock@csiro.au Peter.Hornby@csiro.au k.steube@uq.edu.au"
24    # MAIL_RECIPIENTS="k.steube@uq.edu.au"
25    
26    RunDate=`date '+%Y_%m_%d'`  # Time stamp for log file names
27    
28    WorkDir=/raid3/ksteube/AutoTests
29    cd $WorkDir
30    
31    # Where to put the output of scons run_tests
32    out_file="$WorkDir/Logs/$RunDate.test.output"
33    
34    # Save the name of this script
35    SCRIPT_NAME=$0
36    
37    # Below here \$variable means I want the variable interpreted when PBS runs the job, not when the job is submitted
38    # Similarly for \`...\`
39    
40    # Write the PBS script to run the tests
41    cat << EOF > Logs/$RunDate.pbs.script.sh
42  #!/bin/bash  #!/bin/bash
43    
44  # $Id: autotest-scons 162 2005-11-11 00:09:59Z svn $  #PBS -q q1
45  # An explicit testing script for esys using the scons build system  #PBS -l ncpus=2
46    #PBS -o $RunDate.pbs.stdout
47    #PBS -e $RunDate.pbs.stderr
48    
49    echo "PBS_JOBNAME       \$PBS_JOBNAME"
50    echo "PBS_JOBID         \$PBS_JOBID"
51    echo "PBS_QUEUE         \$PBS_QUEUE"
52    echo "NCPUS             \$NCPUS"
53    echo "USER              \$USER"
54    echo "PBS_O_HOST        \$PBS_O_HOST"
55    echo "PBS_O_WORKDIR     \$PBS_O_WORKDIR"
56    echo "PBS_O_SHELL       \$PBS_O_SHELL"
57    echo ""
58    echo ""
59    
 # list of users to email test results to  
 MAIL_RECIPIENTS="gross@esscc.uq.edu.au elspeth@esscc.uq.edu.au matt@esscc.uq.edu.au robert.woodcock@csiro.au Peter.Hornby@csiro.au"  
60    
61  # the python tests to run  
62  BRUCE_PYTESTS="ImportTest.passed BruceTest.passed test_utilOnBruce.py"  START=\`date '+%Y/%m/%d %H:%M'\`
63  ESCRIPT_PYTESTS="ImportTest.passed BinaryOps.passed UnaryOps.passed SliceGetting.passed SliceSetting.passed MiscTests.passed ArchiveTests.passed newEscriptTests.passed test_xml.passed insituTests.passed s2.passed"  
64  FINLEY_PYTESTS="ImportTest.passed finleyTest.passed SimpleSolve.passed RecTest.passed test_linearPDEsOnFinley.passed test_generators.passed test_visualization_interface.passed test_utilOnFinley.passed"  finish () {
65      END=\`date '+%Y/%m/%d %H:%M'\`
66  echo "===> cd $1"    cat << END_MSG | mail -s "ESYS_TESTS $target $RunDate \$1" $MAIL_RECIPIENTS
67  cd $1  \$2.
68  if [ $? != 0 ]  The tests ran from \$START to \$END.
69  then  See the log files in $WorkDir/Logs for more information.
70    echo "couldnt cd $1"  This mail was sent by $SCRIPT_NAME
71    echo "couldnt cd $1" | mail -s "esys autotest-scons results" $MAIL_RECIPIENTS  running as \$USER on \`hostname\`.
72    exit 1  END_MSG
73  fi    test "x$1" = "FAIL" && exit 1
74      exit 0
75  PWD=`pwd`  }
76  echo "===> working in: $PWD"  
77    
78  # Setup the environment  cd $WorkDir             || finish FAILURE "Could not cd to WorkDir $WorkDir"
79  . ${MODULESHOME}/init/sh  
80  module load intel_cc.9.0.026  # Create an empty out_file
81  export MODULEPATH=${MODULEPATH}:/data/raid2/toolspp4/modulefiles/gcc-3.3.6  cat /dev/null > $out_file       || finish FAILURE "Could not create out_file $out_file"
82    
83    umask 022
84    
85    test -d sandbox.$RunDate        && finish FAILURE "Today's sandbox already exists"
86    mkdir sandbox.$RunDate          || finish FAILURE "Could not mkdir sandbox"
87    cd sandbox.$RunDate         || finish FAILURE "Could not cd to sandbox"
88    
89    echo "Checking out esys13/trunk"
90    svn checkout svn+ssh://shake200.esscc.uq.edu.au/home/www_svn/repos/esys13/trunk >> $out_file 2>&1 || finish FAILURE "Could not check out esys13/trunk"
91    
92    # Load modules
93    . /opt/modules/default/init/bash
94    module use /raid2/matt/modules/modulefiles
95    module use /raid2/toolspp4/modulefiles/gcc-3.3.6
96    module use /usr/share/modules/modulefiles
97    module load esys/env    # Matt's recommended modules
98    module load doxygen/1.4.6
99    # The next line is to avoid /raid3/ksteube/AutoTests/sandbox.2006_06_17/trunk/build/posix/bruce/test/bruce_UnitTest: error while loading shared libraries: libboost_python-mt-d.so.1.33.0: cannot open shared object file: No such file or directory
100  module load boost/1.33.0/python-2.4.1  module load boost/1.33.0/python-2.4.1
 module load python/2.4.1  
 module load numarray/1.3.3  
101    
102  # set openmp settings  
103  export OMP_SCHEDULE="dynamic"  # Had to request 2 CPUs, but only use one for the tests
104  export OMP_NUM_THREADS=4  export OMP_NUM_THREADS=1
105  export OMP_DYNAMIC=TRUE  
106  export OMP_NESTED=FALSE  # Run the tests
107    echo "Running the tests"
108  echo "===> svn update"  cd trunk                || finish FAILURE "Could not cd to trunk"
109  svn update  scons $target >> $out_file 2>&1     || finish FAILURE "Could not run scons $target"
110  if [ $? != 0 ]  
111  then  # Delete files older than 21 days
112    echo "svn update failed"  find $WorkDir -atime +21 -exec rm -f {} \;
113    echo "svn update failed" | mail -s "esys autotest-scons results" $MAIL_RECIPIENTS  
114    exit 2  # Clean up the sandbox
115  fi  cd $WorkDir             || finish FAILURE "Could not cd to clean up WorkDir $WorkDir"
116    /bin/rm -rf sandbox.$RunDate        || finish FAILURE "Could not delete sandbox"
117  echo "===> scons building esys"  
118  scons  finish SUCCESS "Successfully ran 'scons $target', see Logs in $WorkDir on ess"
119  if [ $? != 0 ]  
120  then  EOF
121    echo "scons build failed"  
122    echo "scons build failed" | mail -s "esys autotest-scons results" $MAIL_RECIPIENTS  # cd to the logs area so the PBS logs are deposited there
123    exit 3  cd $WorkDir/Logs
124  fi  
125    # Submit the job
126  echo "===> building unit_tests"  . /opt/modules/default/init/sh
127  scons build_tests  module load pbspro
128  if [ $? != 0 ]  qsub -S /bin/bash $RunDate.pbs.script.sh > /dev/null
129  then  
   echo "unit_test build failed"  
   echo "unit_test build failed" | mail -s "esys autotest-scons results" $MAIL_RECIPIENTS  
   exit 3  
 fi  
   
 FAIL=0  
   
 echo "===> running unit_tests"  
 scons run_tests  
 if [ $? != 0 ]  
 then  
   echo "unit_testing failed"  
   echo "unit_test failed" | mail -s "esys autotest-scons results" $MAIL_RECIPIENTS  
   FAIL=1  
 fi  
   
 for pytest in $ESCRIPT_PYTESTS  
 do  
   echo "===>running escript python test: $pytest"  
   scons build/posix/escript/test/python/$pytest  
   if [ $? != 0 ]  
   then  
     echo "python testing failed for $pytest in module $module"  
     echo "escript py_test: $pytest failed" | mail -s "esys autotest-scons results" $MAIL_RECIPIENTS  
     FAIL=1  
   fi  
 done  
   
 for pytest in $FINLEY_PYTESTS  
 do  
   echo "running finley python test: $pytest"  
   scons build/posix/finley/test/python/$pytest  
   if [ $? != 0 ]  
   then  
     echo "python testing failed for $pytest in module $module"  
     echo "finley py_test: $pytest failed" | mail -s "esys autotest-scons results" $MAIL_RECIPIENTS  
     FAIL=1  
   fi  
 done  
   
 for pytest in $BRUCE_PYTESTS  
 do  
   echo "running bruce python test: $pytest"  
   scons build/posix/bruce/test/python/$pytest  
   if [ $? != 0 ]  
   then  
     echo "python testing failed for $pytest in module $module"  
     echo "bruce py_test: $pytest failed" | mail -s "esys autotest-scons results" $MAIL_RECIPIENTS  
     FAIL=1  
   fi  
 done  
   
 if [ $FAIL == 0 ]  
 then  
     echo success  
     echo "success" | mail -s "esys autotest-scons results" $MAIL_RECIPIENTS  
 fi  
 exit 0  

Legend:
Removed from v.683  
changed lines
  Added in v.739

  ViewVC Help
Powered by ViewVC 1.1.26